{"text_format":"1","workbook":"xlsx","n_sheets":5,"sheets":["Gradient Function A","Gradient Function B","Gradient Function C","Sheet2","Sheet3"],"not_rendered":{"charts":6,"images":13,"macros":1,"external_links":0,"defined_names":0,"comments":0,"pivot_tables":0},"unopened":[],"bounds":{"document_bytes":16777216,"sheet_cells":100000,"rows_first":2000,"rows_last":500,"rows_between":2000,"halvings":0,"cell_chars":16384,"cell_head_chars":4096},"cells_cut":0,"cells_raw":0,"read":"whole","date_system":"1900"}

{"sheet":"Gradient Function A","index":0,"n_rows":203,"n_cols":27,"rows_kept":203,"cut":false,"hidden":false,"merged":[[18,13,18,15],[19,13,19,15],[20,13,20,15],[9,18,9,21],[10,18,10,21],[16,18,16,21],[17,18,17,21],[11,13,11,15],[12,13,12,15],[13,13,13,15],[18,10,18,11],[19,10,19,11],[20,10,20,11],[6,13,6,15],[8,13,8,15],[6,12,7,12],[6,10,7,11],[9,13,9,15],[10,13,10,15],[9,10,9,11],[7,13,7,15],[17,10,17,11],[14,13,14,15],[15,13,15,15],[16,13,16,15],[17,13,17,15],[13,10,13,11],[14,10,14,11],[15,10,15,11],[16,10,16,11],[10,10,10,11],[11,10,11,11],[8,10,8,11],[12,10,12,11]]}
[null,null,null,null,null,{"$f":"MIN(F3:F203)","v":-0.55999999999995453},{"$f":"MAX(G3:G203)","v":-2.4400000000001043},{"$f":"AA4","v":-0.6},null,null,null,null,null,{"$f":"IF(M6=0,\"\",3)","v":3},null,null,{"$f":"IF(P2=\"\",\"\",\"2\")","v":"2"}]
[null,null,null,null,null,null,null,null,null,null,"y","=",{"$f":"IF(M6=0,\"\",M6)","v":1},{"$f":"IF(M6=0,\"\",\"x\")","v":"x"},{"$f":"IF(P6<0,\"-\",IF(P6=0,\"\",IF(M2=\"\",\"\",\"+\")))","v":"+"},{"$f":"IF(P6=0,\"\",ABS(P6))","v":4.5999999999999996},{"$f":"IF(P2=\"\",\"\",\"x\")","v":"x"},{"$f":"IF(S6<0,\"-\",IF(S6=0,\"\",IF(Q2=\"\",\"\",\"+\")))","v":"+"},{"$f":"IF(S6=0,\"\",ABS(S6))","v":2},{"$f":"IF(S2=\"\",\"\",\"x\")","v":"x"},{"$f":"IF(V6<0,\"-\",IF(V6=0,\"\",\"+\"))","v":"-"},{"$f":"IF(V6=0,\"\",ABS(V6))","v":0.8}]
[null,-10,{"$f":"(M$6*B3^3+P$6*B3^2+S$6*B3+V$6)","v":-560.79999999999995},{"$f":"M$6*3*B3^2+2*P$6*B3+S$6","v":210},{"$f":"IF((B3-AA$4)^2<0.001,D3,11)","v":11},{"$f":"IF((B3-AA$4)^2<0.001,C3,11)","v":11},{"$f":"IF(F3=11,\"\",D3)","v":""},{"$f":"B3","v":-10},{"$f":"G$1*H3+(F$1-G$1*H$1)","v":22.376000000001028}]
[null,{"$f":"B3+0.1","v":-9.9},-540.053,204.95000000000005,{"$f":"IF((B4-AA$4)^2<0.001,D4,11)","v":11},{"$f":"IF((B4-AA$4)^2<0.001,C4,11)","v":11},"",-9.9,22.132000000001014,null,null,null,90,null,null,90,null,null,90,null,null,90,null,null,90,84,{"$f":"(Z4-Y4)/10","v":-0.6}]
[null,{"$f":"B4+0.1","v":-9.8000000000000007},-519.80800000000011,199.96000000000006,11,11,"",-9.8000000000000007,21.888000000001007,null,null,null,100,null,null,136,null,null,110,null,null,82]
[null,-9.7000000000000011,-500.0590000000002,195.03000000000003,11,11,"",-9.7000000000000011,21.644000000001,null,null,null,{"$f":"(M5-M4)/10","v":1},null,null,{"$f":"(P5-P4)/10","v":4.5999999999999996},null,null,{"$f":"(S5-S4)/10","v":2},null,null,{"$f":"(V5-V4)/10","v":-0.8}]
[null,-9.6000000000000014,-480.80000000000024,190.16000000000008,11,11,"",-9.6000000000000014,21.400000000000986,null,"x",null,"y","Gradient"]
[null,-9.5000000000000018,-462.02500000000038,185.35000000000011,11,11,"",-9.5000000000000018,21.156000000000979,null,null,null,null,"values"]
[null,-9.4000000000000021,-443.72800000000046,180.60000000000014,11,11,"",-9.4000000000000021,20.912000000000965,null,-6,null,{"$f":"C43","v":-63.200000000000799},{"$f":"D43","v":54.800000000000388}]
[null,-9.3000000000000025,-425.90300000000047,175.91000000000014,11,11,"",-9.3000000000000025,20.668000000000958,null,{"$f":"K9+1","v":-5},null,{"$f":"C53","v":-20.800000000000562},{"$f":"D53","v":31.000000000000384},null,null,null,null,"x' value"]
[null,-9.2000000000000028,-408.54400000000061,171.28000000000017,11,11,"",-9.2000000000000028,20.424000000000952,null,-4,null,{"$f":"C63","v":0.79999999999971005},{"$f":"D63","v":13.200000000000315},null,null,null,null,{"$f":"H1","v":-0.6}]
[null,-9.1000000000000032,-391.64500000000061,166.71000000000015,11,11,"",-9.1000000000000032,20.180000000000938,null,-3,null,{"$f":"C73","v":7.5999999999999686},{"$f":"D73","v":1.4000000000001833}]
[null,-9.0000000000000036,-375.20000000000056,162.20000000000016,11,11,"",-9.0000000000000036,19.936000000000931,null,-2,null,{"$f":"C83","v":5.600000000000084},{"$f":"D83","v":-4.3999999999999453}]
[null,-8.9000000000000039,-359.2030000000006,157.75000000000017,11,11,"",-8.9000000000000039,19.692000000000924,null,-1,null,{"$f":"C93","v":0.80000000000007776},{"$f":"D93","v":-4.2000000000000597}]
[null,-8.8000000000000043,-343.64800000000065,153.36000000000018,11,11,"",-8.8000000000000043,19.44800000000091,null,0,null,{"$f":"C103","v":-0.80000000000003757},{"$f":"D103","v":1.999999999999827}]
[null,-8.7000000000000046,-328.52900000000074,149.0300000000002,11,11,"",-8.7000000000000046,19.204000000000903,null,1,null,{"$f":"C113","v":6.7999999999997316},{"$f":"D113","v":14.199999999999712}]
[null,-8.600000000000005,-313.84000000000071,144.76000000000019,11,11,"",-8.600000000000005,18.960000000000889,null,2,null,{"$f":"C123","v":29.599999999999415},{"$f":"D123","v":32.399999999999615},null,null,null,null,"Gradient at 'x'"]
[null,-8.5000000000000053,-299.57500000000078,140.55000000000021,11,11,"",-8.5000000000000053,18.716000000000882,null,3,null,{"$f":"C133","v":73.599999999999028},{"$f":"D133","v":56.599999999999525},null,null,null,null,{"$f":"G1","v":-2.4400000000001043}]
[null,-8.4000000000000057,-285.7280000000008,136.40000000000026,11,11,"",-8.4000000000000057,18.472000000000875,null,4,null,{"$f":"C143","v":144.79999999999856},{"$f":"D143","v":86.799999999999443}]
[null,-8.300000000000006,-272.29300000000086,132.31000000000023,11,11,"",-8.300000000000006,18.228000000000861,null,5,null,{"$f":"C153","v":249.19999999999757},{"$f":"D153","v":122.99999999999923}]
[null,-8.2000000000000064,-259.26400000000086,128.28000000000026,11,11,"",-8.2000000000000064,17.984000000000854,null,6,null,{"$f":"C163","v":392.79999999999615},{"$f":"D163","v":165.19999999999897}]
[null,-8.1000000000000068,-246.63500000000093,124.31000000000027,11,11,"",-8.1000000000000068,17.740000000000848]
[null,-8.0000000000000071,-234.40000000000089,120.40000000000028,11,11,"",-8.0000000000000071,17.496000000000834]
[null,-7.9000000000000075,-222.55300000000091,116.5500000000003,11,11,"",-7.9000000000000075,17.252000000000827]
[null,-7.8000000000000078,-211.08800000000093,112.76000000000032,11,11,"",-7.8000000000000078,17.008000000000813]
[null,-7.7000000000000082,-199.9990000000009,109.0300000000003,11,11,"",-7.7000000000000082,16.764000000000806]
[null,-7.6000000000000085,-189.28000000000091,105.36000000000033,11,11,"",-7.6000000000000085,16.520000000000799]
[null,-7.5000000000000089,-178.92500000000095,101.75000000000033,11,11,"",-7.5000000000000089,16.276000000000785]
[null,-7.4000000000000092,-168.92800000000094,98.200000000000344,11,11,"",-7.4000000000000092,16.032000000000778]
[null,-7.3000000000000096,-159.28300000000092,94.710000000000349,11,11,"",-7.3000000000000096,15.788000000000769]
[null,-7.2000000000000099,-149.98400000000095,91.280000000000356,11,11,"",-7.2000000000000099,15.544000000000759]
[null,-7.1000000000000103,-141.02500000000092,87.910000000000352,11,11,"",-7.1000000000000103,15.300000000000749]
[null,-7.0000000000000107,-132.40000000000097,84.600000000000364,11,11,"",-7.0000000000000107,15.056000000000738]
[null,-6.900000000000011,-124.10300000000092,81.350000000000335,11,11,"",-6.900000000000011,14.812000000000731]
[null,-6.8000000000000114,{"$f":"(M$6*B35^3+P$6*B35^2+S$6*B35+V$6)","v":-116.12800000000088},{"$f":"M$6*3*B35^2+2*P$6*B35+S$6","v":78.160000000000352},11,11,{"$f":"IF(F35=11,\"\",D35)","v":""},{"$f":"B35","v":-6.8000000000000114},{"$f":"G$1*H35+(F$1-G$1*H$1)","v":14.568000000000721}]
[null,-6.7000000000000117,-108.46900000000088,75.030000000000371,11,11,"",-6.7000000000000117,14.32400000000071]
[null,-6.6000000000000121,-101.12000000000087,71.960000000000349,11,11,"",-6.6000000000000121,14.0800000000007]
[null,-6.5000000000000124,-94.075000000000884,68.950000000000372,11,11,"",-6.5000000000000124,13.836000000000691]
[null,-6.4000000000000128,-87.328000000000884,66.000000000000369,11,11,"",-6.4000000000000128,13.592000000000683]
[null,-6.3000000000000131,-80.873000000000857,63.11000000000039,11,11,"",-6.3000000000000131,13.348000000000672]
[null,-6.2000000000000135,-74.704000000000846,60.280000000000385,11,11,"",-6.2000000000000135,13.104000000000664]
[null,-6.1000000000000139,-68.815000000000822,57.510000000000382,11,11,"",-6.1000000000000139,12.860000000000653]
[null,-6.0000000000000142,-63.200000000000799,54.800000000000388,11,11,"",-6.0000000000000142,12.616000000000644]
[null,-5.9000000000000146,-57.853000000000776,52.150000000000389,11,11,"",-5.9000000000000146,12.372000000000634]
[null,-5.8000000000000149,-52.768000000000761,49.560000000000379,11,11,"",-5.8000000000000149,12.128000000000624]
[null,-5.7000000000000153,-47.939000000000746,47.030000000000371,11,11,"",-5.7000000000000153,11.884000000000615]
[null,-5.6000000000000156,-43.360000000000696,44.560000000000386,11,11,"",-5.6000000000000156,11.640000000000605]
[null,-5.500000000000016,-39.025000000000674,42.150000000000396,11,11,"",-5.500000000000016,11.396000000000596]
[null,-5.4000000000000163,-34.928000000000658,39.800000000000381,11,11,"",-5.4000000000000163,11.152000000000585]
[null,-5.3000000000000167,-31.063000000000642,37.510000000000389,11,11,"",-5.3000000000000167,10.908000000000577]
[null,-5.2000000000000171,-27.424000000000593,35.280000000000378,11,11,"",-5.2000000000000171,10.664000000000566]
[null,-5.1000000000000174,-24.005000000000599,33.110000000000383,11,11,"",-5.1000000000000174,10.420000000000558]
[null,-5.0000000000000178,-20.800000000000562,31.000000000000384,11,11,"",-5.0000000000000178,10.176000000000547]
[null,-4.9000000000000181,-17.803000000000523,28.950000000000379,11,11,"",-4.9000000000000181,9.9320000000005386]
[null,-4.8000000000000185,-15.008000000000511,26.960000000000363,11,11,"",-4.8000000000000185,9.6880000000005282]
[null,-4.7000000000000188,-12.409000000000468,25.030000000000364,11,11,"",-4.7000000000000188,9.4440000000005195]
[null,-4.6000000000000192,-10.000000000000451,23.160000000000359,11,11,"",-4.6000000000000192,9.2000000000005091]
[null,-4.5000000000000195,-7.7750000000004169,21.350000000000357,11,11,"",-4.5000000000000195,8.9560000000005004]
[null,-4.4000000000000199,-5.728000000000395,19.600000000000342,11,11,"",-4.4000000000000199,8.71200000000049]
[null,-4.3000000000000203,-3.8530000000003701,17.910000000000338,11,11,"",-4.3000000000000203,8.4680000000004814]
[null,-4.2000000000000206,-2.1440000000003421,16.280000000000342,11,11,"",-4.2000000000000206,8.2240000000004709]
[null,-4.100000000000021,-0.59500000000031084,14.710000000000328,11,11,"",-4.100000000000021,7.9800000000004623]
[null,-4.0000000000000213,0.79999999999971005,13.200000000000315,11,11,"",-4.0000000000000213,7.7360000000004518]
[null,-3.9000000000000212,2.0469999999997501,11.750000000000306,11,11,"",-3.9000000000000212,7.4920000000004414]
[null,-3.8000000000000211,3.1519999999997728,10.360000000000291,11,11,"",-3.8000000000000211,7.248000000000431]
[null,-3.700000000000021,4.1209999999998068,9.0300000000002782,11,11,"",-3.700000000000021,7.0040000000004206]
[null,-3.600000000000021,{"$f":"(M$6*B67^3+P$6*B67^2+S$6*B67+V$6)","v":4.9599999999998383},{"$f":"M$6*3*B67^2+2*P$6*B67+S$6","v":7.7600000000002609},11,11,{"$f":"IF(F67=11,\"\",D67)","v":""},{"$f":"B67","v":-3.600000000000021},{"$f":"G$1*H67+(F$1-G$1*H$1)","v":6.7600000000004101}]
[null,-3.5000000000000209,5.6749999999998533,6.550000000000253,{"$f":"IF((B68-AA$4)^2<0.001,D68,11)","v":11},{"$f":"IF((B68-AA$4)^2<0.001,C68,11)","v":11},"",-3.5000000000000209,6.5160000000003997]
[null,{"$f":"B68+0.1","v":-3.4000000000000208},6.2719999999998803,5.4000000000002295,11,11,"",-3.4000000000000208,6.2720000000003893]
[null,-3.3000000000000207,6.7569999999999055,4.3100000000002261,11,11,"",-3.3000000000000207,6.0280000000003771]
[null,-3.2000000000000206,7.1359999999999291,3.2800000000002107,11,11,"",-3.2000000000000206,5.7840000000003675]
[null,-3.1000000000000205,7.4149999999999539,2.3100000000001941,11,11,"",-3.1000000000000205,5.5400000000003562]
[null,-3.0000000000000204,7.5999999999999686,1.4000000000001833,11,11,"",-3.0000000000000204,5.2960000000003458]
[null,-2.9000000000000203,7.6969999999999894,0.55000000000016769,11,11,"",-2.9000000000000203,5.0520000000003353]
[null,-2.8000000000000203,7.7120000000000006,-0.23999999999984212,11,11,"",-2.8000000000000203,4.8080000000003249]
[null,-2.7000000000000202,7.651000000000022,-0.96999999999985675,11,11,"",-2.7000000000000202,4.5640000000003136]
[null,-2.6000000000000201,7.5200000000000307,-1.6399999999998691,11,11,"",-2.6000000000000201,4.3200000000003032]
[null,-2.50000000000002,7.3250000000000428,-2.2499999999998828,11,11,"",-2.50000000000002,4.0760000000002927]
[null,-2.4000000000000199,7.0720000000000551,-2.7999999999998977,11,11,"",-2.4000000000000199,3.8320000000002823]
[null,-2.3000000000000198,6.7670000000000634,-3.2899999999999068,11,11,"",-2.3000000000000198,3.588000000000271]
[null,-2.2000000000000197,6.4160000000000705,-3.7199999999999189,11,11,"",-2.2000000000000197,3.3440000000002605]
[null,-2.1000000000000196,6.0250000000000785,-4.0899999999999288,11,11,"",-2.1000000000000196,3.1000000000002501]
[null,-2.0000000000000195,5.600000000000084,-4.3999999999999453,11,11,"",-2.0000000000000195,2.8560000000002397]
[null,-1.9000000000000195,5.1470000000000891,-4.6499999999999559,11,11,"",-1.9000000000000195,2.6120000000002284]
[null,-1.8000000000000194,4.6720000000000921,-4.8399999999999679,11,11,"",-1.8000000000000194,2.3680000000002179]
[null,-1.7000000000000193,4.1810000000000951,-4.9699999999999793,11,11,"",-1.7000000000000193,2.1240000000002075]
[null,-1.6000000000000192,3.6800000000000948,-5.0399999999999903,11,11,"",-1.6000000000000192,1.8800000000001966]
[null,-1.5000000000000191,3.1750000000000957,-5.0500000000000025,11,11,"",-1.5000000000000191,1.6360000000001862]
[null,-1.400000000000019,2.6720000000000956,-5.0000000000000133,11,11,"",-1.400000000000019,1.3920000000001753]
[null,-1.3000000000000189,2.177000000000092,-4.8900000000000254,11,11,"",-1.3000000000000189,1.1480000000001649]
[null,-1.2000000000000188,1.6960000000000883,-4.7200000000000379,11,11,"",-1.2000000000000188,0.90400000000015401]
[null,-1.1000000000000187,1.2350000000000836,-4.4900000000000482,11,11,"",-1.1000000000000187,0.66000000000014358]
[null,-1.0000000000000187,0.80000000000007776,-4.2000000000000597,11,11,"",-1.0000000000000187,0.41600000000013271]
[null,-0.90000000000001867,0.3970000000000713,-3.8500000000000707,11,11,"",-0.90000000000001867,0.17200000000012272]
[null,-0.8000000000000187,3.2000000000063755E-2,-3.4400000000000821,11,11,"",-0.8000000000000187,-7.1999999999887931E-2]
[null,-0.70000000000001872,-0.28899999999994463,-2.970000000000093,11,11,"",-0.70000000000001872,-0.31599999999989814]
[null,-0.60000000000001874,-0.55999999999995453,-2.4400000000001043,-2.4400000000001043,-0.55999999999995453,-2.4400000000001043,-0.60000000000001874,-0.55999999999990857]
[null,-0.50000000000001876,-0.77499999999996527,-1.8500000000001156,11,11,"",-0.50000000000001876,-0.803999999999919]
[null,-0.40000000000001878,{"$f":"(M$6*B99^3+P$6*B99^2+S$6*B99+V$6)","v":-0.92799999999997762},-1.2000000000001272,11,11,{"$f":"IF(F99=11,\"\",D99)","v":""},-0.40000000000001878,{"$f":"G$1*H99+(F$1-G$1*H$1)","v":-1.0479999999999294}]
[null,-0.30000000000001881,{"$f":"(M$6*B100^3+P$6*B100^2+S$6*B100+V$6)","v":-1.012999999999991},-0.49000000000013921,11,11,{"$f":"IF(F100=11,\"\",D100)","v":""},-0.30000000000001881,{"$f":"G$1*H100+(F$1-G$1*H$1)","v":-1.2919999999999399}]
[null,-0.2000000000000188,{"$f":"(M$6*B101^3+P$6*B101^2+S$6*B101+V$6)","v":-1.0240000000000054},0.2799999999998497,11,11,{"$f":"IF(F101=11,\"\",D101)","v":""},-0.2000000000000188,{"$f":"G$1*H101+(F$1-G$1*H$1)","v":-1.5359999999999503}]
[null,-0.1000000000000188,{"$f":"(M$6*B102^3+P$6*B102^2+S$6*B102+V$6)","v":-0.95500000000002094},1.1099999999998382,11,11,{"$f":"IF(F102=11,\"\",D102)","v":""},-0.1000000000000188,{"$f":"G$1*H102+(F$1-G$1*H$1)","v":-1.7799999999999607}]
[null,-1.8790524691780774E-14,{"$f":"(M$6*B103^3+P$6*B103^2+S$6*B103+V$6)","v":-0.80000000000003757},1.999999999999827,11,11,{"$f":"IF(F103=11,\"\",D103)","v":""},-1.8790524691780774E-14,{"$f":"G$1*H103+(F$1-G$1*H$1)","v":-2.0239999999999712}]
[null,{"$f":"B103+0.1","v":9.9999999999981215E-2},{"$f":"(M$6*B104^3+P$6*B104^2+S$6*B104+V$6)","v":-0.55300000000005545},{"$f":"M$6*3*B104^2+2*P$6*B104+S$6","v":2.9499999999998159},11,11,{"$f":"IF(F104=11,\"\",D104)","v":""},{"$f":"B104","v":9.9999999999981215E-2},{"$f":"G$1*H104+(F$1-G$1*H$1)","v":-2.2679999999999816}]
[null,0.19999999999998122,-0.20800000000007446,3.9599999999998046,11,11,"",0.19999999999998122,-2.511999999999992]
[null,0.29999999999998123,0.24099999999990551,5.0299999999997933,11,11,"",0.29999999999998123,-2.7560000000000024]
[null,0.39999999999998126,0.79999999999988458,6.1599999999997825,11,11,"",0.39999999999998126,-3.0000000000000129]
[null,0.49999999999998124,1.4749999999998618,7.3499999999997714,11,11,"",0.49999999999998124,-3.2440000000000233]
[null,0.59999999999998122,2.2719999999998386,8.5999999999997598,11,11,"",0.59999999999998122,-3.4880000000000337]
[null,0.69999999999998119,3.1969999999998135,9.9099999999997479,11,11,"",0.69999999999998119,-3.7320000000000437]
[null,0.79999999999998117,4.255999999999788,11.279999999999736,11,11,"",0.79999999999998117,-3.9760000000000542]
[null,0.89999999999998115,5.4549999999997603,12.709999999999724,11,11,"",0.89999999999998115,-4.2200000000000646]
[null,0.99999999999998113,6.7999999999997316,14.199999999999712,11,11,"",0.99999999999998113,-4.464000000000075]
[null,1.0999999999999812,8.2969999999997039,15.749999999999703,11,11,"",1.0999999999999812,-4.7080000000000854]
[null,1.1999999999999813,9.9519999999996749,17.359999999999694,11,11,"",1.1999999999999813,-4.9520000000000959]
[null,1.2999999999999814,11.770999999999644,19.029999999999681,11,11,"",1.2999999999999814,-5.1960000000001072]
[null,1.3999999999999815,13.759999999999616,20.759999999999671,11,11,"",1.3999999999999815,-5.4400000000001176]
[null,1.4999999999999816,15.924999999999585,22.549999999999663,11,11,"",1.4999999999999816,-5.6840000000001289]
[null,1.5999999999999817,18.271999999999551,24.399999999999654,11,11,"",1.5999999999999817,-5.9280000000001394]
[null,1.6999999999999817,20.806999999999515,26.309999999999643,11,11,"",1.6999999999999817,-6.1720000000001498]
[null,1.7999999999999818,23.535999999999483,28.279999999999635,11,11,"",1.7999999999999818,-6.4160000000001602]
[null,1.8999999999999819,26.464999999999449,30.309999999999626,11,11,"",1.8999999999999819,-6.6600000000001707]
[null,1.999999999999982,29.599999999999415,32.399999999999615,11,11,"",1.999999999999982,-6.904000000000182]
[null,2.0999999999999819,32.946999999999377,34.549999999999606,11,11,"",2.0999999999999819,-7.1480000000001915]
[null,2.199999999999982,36.51199999999934,36.759999999999593,11,11,"",2.199999999999982,-7.392000000000202]
[null,2.2999999999999821,40.300999999999306,39.029999999999589,11,11,"",2.2999999999999821,-7.6360000000002133]
[null,2.3999999999999821,44.319999999999261,41.35999999999958,11,11,"",2.3999999999999821,-7.8800000000002237]
[null,2.4999999999999822,48.574999999999221,43.749999999999574,11,11,"",2.4999999999999822,-8.1240000000002333]
[null,2.5999999999999823,53.071999999999186,46.199999999999562,11,11,"",2.5999999999999823,-8.3680000000002437]
[null,2.6999999999999824,57.81699999999914,48.709999999999553,11,11,"",2.6999999999999824,-8.6120000000002559]
[null,2.7999999999999825,62.815999999999107,51.279999999999546,11,11,"",2.7999999999999825,-8.8560000000002663]
[null,2.8999999999999826,68.074999999999065,53.909999999999535,{"$f":"IF((B132-AA$4)^2<0.001,D132,11)","v":11},{"$f":"IF((B132-AA$4)^2<0.001,C132,11)","v":11},"",2.8999999999999826,-9.1000000000002768]
[null,2.9999999999999827,73.599999999999028,56.599999999999525,11,11,"",2.9999999999999827,-9.3440000000002872]
[null,3.0999999999999828,79.396999999998968,59.349999999999518,11,11,"",3.0999999999999828,-9.5880000000002994]
[null,3.1999999999999829,85.471999999998928,62.159999999999513,11,11,"",3.1999999999999829,-9.8320000000003098]
[null,3.2999999999999829,91.830999999998895,65.029999999999504,11,11,"",3.2999999999999829,-10.07600000000032]
[null,3.399999999999983,98.479999999998853,67.959999999999496,11,11,"",3.399999999999983,-10.320000000000331]
[null,3.4999999999999831,105.4249999999988,70.949999999999477,11,11,"",3.4999999999999831,-10.564000000000341]
[null,3.5999999999999832,112.67199999999875,73.999999999999474,11,11,"",3.5999999999999832,-10.808000000000352]
[null,3.6999999999999833,120.22699999999871,77.109999999999474,11,11,"",3.6999999999999833,-11.052000000000362]
[null,3.7999999999999834,128.09599999999864,80.279999999999461,11,11,"",3.7999999999999834,-11.296000000000372]
[null,3.8999999999999835,136.2849999999986,83.509999999999451,11,11,"",3.8999999999999835,-11.540000000000383]
[null,3.9999999999999836,144.79999999999856,86.799999999999443,11,11,"",3.9999999999999836,-11.784000000000393]
[null,4.0999999999999837,153.64699999999851,90.149999999999451,11,11,"",4.0999999999999837,-12.028000000000405]
[null,4.1999999999999833,162.8319999999984,93.55999999999942,11,11,"",4.1999999999999833,-12.272000000000414]
[null,4.2999999999999829,172.36099999999834,97.029999999999404,11,11,"",4.2999999999999829,-12.516000000000425]
[null,4.3999999999999826,182.23999999999822,100.55999999999938,11,11,"",4.3999999999999826,-12.760000000000433]
[null,4.4999999999999822,192.47499999999812,104.14999999999935,11,11,"",4.4999999999999822,-13.004000000000444]
[null,4.5999999999999819,203.07199999999804,107.79999999999933,11,11,"",4.5999999999999819,-13.248000000000452]
[null,4.6999999999999815,214.03699999999793,111.50999999999929,11,11,"",4.6999999999999815,-13.492000000000463]
[null,4.7999999999999812,225.37599999999782,115.27999999999928,11,11,"",4.7999999999999812,-13.736000000000471]
[null,4.8999999999999808,237.0949999999977,119.10999999999925,11,11,"",4.8999999999999808,-13.980000000000482]
[null,4.9999999999999805,249.19999999999757,122.99999999999923,11,11,"",4.9999999999999805,-14.22400000000049]
[null,5.0999999999999801,261.69699999999744,126.94999999999919,11,11,"",5.0999999999999801,-14.468000000000501]
[null,{"$f":"B154+0.1","v":5.1999999999999797},{"$f":"(M$6*B155^3+P$6*B155^2+S$6*B155+V$6)","v":274.59199999999731},{"$f":"M$6*3*B155^2+2*P$6*B155+S$6","v":130.95999999999918},11,11,{"$f":"IF(F155=11,\"\",D155)","v":""},{"$f":"B155","v":5.1999999999999797},{"$f":"G$1*H155+(F$1-G$1*H$1)","v":-14.71200000000051}]
[null,5.2999999999999794,287.89099999999723,135.02999999999918,11,11,"",5.2999999999999794,-14.95600000000052]
[null,5.399999999999979,301.59999999999701,139.15999999999912,11,11,"",5.399999999999979,-15.200000000000529]
[null,5.4999999999999787,315.7249999999969,143.34999999999908,11,11,"",5.4999999999999787,-15.444000000000539]
[null,5.5999999999999783,330.27199999999675,147.59999999999906,11,11,"",5.5999999999999783,-15.688000000000548]
[null,5.699999999999978,345.2469999999966,151.90999999999903,11,11,"",5.699999999999978,-15.932000000000558]
[null,5.7999999999999776,360.65599999999642,156.27999999999901,11,11,"",5.7999999999999776,-16.176000000000567]
[null,5.8999999999999773,376.5049999999963,160.70999999999898,11,11,"",5.8999999999999773,-16.420000000000577]
[null,5.9999999999999769,392.79999999999615,165.19999999999897,11,11,"",5.9999999999999769,-16.664000000000584]
[null,6.0999999999999766,409.54699999999599,169.74999999999892,11,11,"",6.0999999999999766,-16.908000000000598]
[null,6.1999999999999762,426.75199999999592,174.35999999999888,11,11,"",6.1999999999999762,-17.152000000000605]
[null,6.2999999999999758,444.42099999999562,179.02999999999886,11,11,"",6.2999999999999758,-17.396000000000615]
[null,6.3999999999999755,462.55999999999545,183.75999999999883,11,11,"",6.3999999999999755,-17.640000000000626]
[null,6.4999999999999751,481.17499999999524,188.54999999999879,11,11,"",6.4999999999999751,-17.884000000000633]
[null,6.5999999999999748,500.2719999999951,193.39999999999878,11,11,"",6.5999999999999748,-18.128000000000647]
[null,6.6999999999999744,519.85699999999497,198.30999999999875,11,11,"",6.6999999999999744,-18.372000000000654]
[null,6.7999999999999741,539.93599999999469,203.27999999999869,11,11,"",6.7999999999999741,-18.61600000000066]
[null,6.8999999999999737,560.51499999999464,208.30999999999867,11,11,"",6.8999999999999737,-18.860000000000674]
[null,6.9999999999999734,581.59999999999445,213.39999999999864,11,11,"",6.9999999999999734,-19.104000000000681]
[null,7.099999999999973,603.1969999999942,218.54999999999859,11,11,"",7.099999999999973,-19.348000000000688]
[null,7.1999999999999726,625.31199999999387,223.75999999999857,11,11,"",7.1999999999999726,-19.592000000000702]
[null,7.2999999999999723,647.95099999999366,229.02999999999852,11,11,"",7.2999999999999723,-19.836000000000709]
[null,7.3999999999999719,671.11999999999352,234.35999999999848,11,11,"",7.3999999999999719,-20.080000000000723]
[null,7.4999999999999716,694.82499999999322,239.74999999999847,11,11,"",7.4999999999999716,-20.32400000000073]
[null,7.5999999999999712,719.07199999999295,245.19999999999843,11,11,"",7.5999999999999712,-20.568000000000737]
[null,7.6999999999999709,743.8669999999928,250.70999999999839,11,11,"",7.6999999999999709,-20.812000000000751]
[null,7.7999999999999705,769.21599999999239,256.27999999999832,11,11,"",7.7999999999999705,-21.056000000000758]
[null,7.8999999999999702,795.12499999999227,261.90999999999832,11,11,"",7.8999999999999702,-21.300000000000772]
[null,7.9999999999999698,821.59999999999184,267.59999999999826,11,11,"",7.9999999999999698,-21.544000000000779]
[null,8.0999999999999694,848.64699999999164,273.3499999999982,11,11,"",8.0999999999999694,-21.788000000000785]
[null,8.1999999999999691,876.27199999999141,279.15999999999821,11,11,"",8.1999999999999691,-22.032000000000799]
[null,8.2999999999999687,904.4809999999909,285.02999999999815,11,11,"",8.2999999999999687,-22.276000000000806]
[null,8.3999999999999684,933.27999999999076,290.9599999999981,11,11,"",8.3999999999999684,-22.520000000000813]
[null,8.499999999999968,962.67499999999052,296.94999999999811,11,11,"",8.499999999999968,-22.764000000000827]
[null,8.5999999999999677,992.67199999999013,302.99999999999801,11,11,"",8.5999999999999677,-23.008000000000834]
[null,8.6999999999999673,1023.2769999999898,309.10999999999797,11,11,"",8.6999999999999673,-23.252000000000848]
[null,8.799999999999967,1054.4959999999894,315.27999999999793,11,11,"",8.799999999999967,-23.496000000000855]
[null,8.8999999999999666,1086.3349999999893,321.50999999999794,11,11,"",8.8999999999999666,-23.740000000000862]
[null,8.9999999999999662,1118.799999999989,327.79999999999785,11,11,"",8.9999999999999662,-23.984000000000876]
[null,9.0999999999999659,1151.8969999999883,334.14999999999782,11,11,"",9.0999999999999659,-24.228000000000883]
[null,9.1999999999999655,1185.6319999999882,340.55999999999779,11,11,"",9.1999999999999655,-24.472000000000889]
[null,9.2999999999999652,1220.0109999999879,347.02999999999776,{"$f":"IF((B196-AA$4)^2<0.001,D196,11)","v":11},{"$f":"IF((B196-AA$4)^2<0.001,C196,11)","v":11},"",9.2999999999999652,-24.716000000000903]
[null,9.3999999999999648,1255.0399999999877,353.55999999999773,11,11,"",9.3999999999999648,-24.96000000000091]
[null,{"$f":"B197+0.1","v":9.4999999999999645},{"$f":"(M$6*B198^3+P$6*B198^2+S$6*B198+V$6)","v":1290.7249999999872},{"$f":"M$6*3*B198^2+2*P$6*B198+S$6","v":360.14999999999759},11,11,{"$f":"IF(F198=11,\"\",D198)","v":""},{"$f":"B198","v":9.4999999999999645},{"$f":"G$1*H198+(F$1-G$1*H$1)","v":-25.204000000000924}]
[null,9.5999999999999641,1327.0719999999867,366.79999999999762,11,11,"",9.5999999999999641,-25.448000000000931]
[null,9.6999999999999638,1364.0869999999863,373.50999999999755,11,11,"",9.6999999999999638,-25.692000000000938]
[null,9.7999999999999634,1401.775999999986,380.27999999999747,11,11,"",9.7999999999999634,-25.936000000000952]
[null,9.8999999999999631,1440.1449999999857,387.10999999999746,11,11,"",9.8999999999999631,-26.180000000000959]
[null,9.9999999999999627,1479.1999999999855,393.99999999999744,11,11,"",9.9999999999999627,-26.424000000000966]

{"sheet":"Gradient Function B","index":1,"n_rows":103,"n_cols":27,"rows_kept":103,"cut":false,"hidden":false,"merged":[[20,13,20,15],[9,18,9,21],[10,18,10,21],[16,18,16,21],[17,18,17,21],[11,13,11,15],[12,13,12,15],[13,13,13,15],[20,10,20,11],[6,13,6,15],[8,13,8,15],[6,12,7,12],[6,10,7,11],[9,13,9,15],[10,13,10,15],[9,10,9,11],[18,13,18,15],[19,13,19,15],[8,10,8,11],[12,10,12,11],[13,10,13,11],[14,10,14,11],[18,10,18,11],[19,10,19,11],[7,13,7,15],[15,10,15,11],[16,10,16,11],[17,10,17,11],[14,13,14,15],[15,13,15,15],[16,13,16,15],[17,13,17,15],[10,10,10,11],[11,10,11,11]]}
[null,null,null,null,null,{"$f":"MIN(F3:F103)","v":0.9119999999999937},{"$f":"MAX(G3:G103)","v":3.7599999999999962},{"$f":"AA4","v":3.4},null,null,null,null,null,{"$f":"IF(M6=0,\"\",3)","v":""},null,null,{"$f":"IF(P2=\"\",\"\",\"2\")","v":"2"}]
[null,null,null,null,null,null,null,null,null,null,"y","=",{"$f":"IF(M6=0,\"\",M6)","v":""},{"$f":"IF(M6=0,\"\",\"x\")","v":""},{"$f":"IF(P6<0,\"-\",IF(P6=0,\"\",IF(M2=\"\",\"\",\"+\")))","v":""},{"$f":"IF(P6=0,\"\",ABS(P6))","v":1.2},{"$f":"IF(P2=\"\",\"\",\"x\")","v":"x"},{"$f":"IF(S6<0,\"-\",IF(S6=0,\"\",IF(Q2=\"\",\"\",\"+\")))","v":"-"},{"$f":"IF(S6=0,\"\",ABS(S6))","v":4.4000000000000004},{"$f":"IF(S2=\"\",\"\",\"x\")","v":"x"},{"$f":"IF(V6<0,\"-\",IF(V6=0,\"\",\"+\"))","v":"+"},{"$f":"ABS(V6)","v":2}]
[null,-10,{"$f":"(M$6*B3^3+P$6*B3^2+S$6*B3+V$6)","v":166},{"$f":"M$6*3*B3^2+2*P$6*B3+S$6","v":-28.4},{"$f":"IF((B3-AA$4)^2<0.01,D3,11)","v":11},{"$f":"IF((B3-AA$4)^2<0.01,C3,11)","v":11},{"$f":"IF(F3=11,\"\",D3)","v":""},{"$f":"IF(B3<AA$4-2,14,IF(B3>AA$4+2,14,B3))","v":14},{"$f":"IF(H3=14,14,G$1*H3+(F$1-G$1*H$1))","v":14}]
[null,{"$f":"B3+0.2","v":-9.8000000000000007},{"$f":"(M$6*B4^3+P$6*B4^2+S$6*B4+V$6)","v":160.36800000000002},-27.92,11,11,{"$f":"IF(F4=11,\"\",D4)","v":""},14,{"$f":"IF(H4=14,14,G$1*H4+(F$1-G$1*H$1))","v":14},null,null,null,90,null,null,90,null,null,90,null,null,90,null,null,45,62,{"$f":"(Z4-Y4)/5","v":3.4}]
[null,{"$f":"B4+0.2","v":-9.6000000000000014},154.83200000000005,-27.440000000000005,11,11,"",14,14,null,null,null,90,null,null,102,null,null,46,null,null,110]
[null,-9.4000000000000021,149.39200000000005,-26.960000000000008,11,11,"",14,14,null,null,null,{"$f":"(M5-M4)/10","v":0},null,null,{"$f":"(P5-P4)/10","v":1.2},null,null,{"$f":"(S5-S4)/10","v":-4.4000000000000004},null,null,{"$f":"(V5-V4)/10","v":2}]
[null,-9.2000000000000028,144.04800000000009,-26.480000000000004,11,11,"",14,14,null,"x",null,"y","Gradient"]
[null,-9.0000000000000036,138.80000000000007,-26.000000000000007,11,11,"",14,14,null,null,null,null,"values"]
[null,-8.8000000000000043,133.64800000000011,-25.52000000000001,11,11,"",14,14,null,-6,null,{"$f":"C23","v":71.600000000000108},{"$f":"D23","v":-18.800000000000011}]
[null,-8.600000000000005,128.59200000000013,-25.040000000000013,11,11,"",14,14,null,{"$f":"K9+1","v":-5},null,{"$f":"C28","v":54.000000000000071},{"$f":"D28","v":-16.400000000000013},null,null,null,null,"x' value"]
[null,-8.4000000000000057,123.63200000000015,-24.560000000000016,11,11,"",14,14,null,{"$f":"K10+1","v":-4},null,{"$f":"C33","v":38.800000000000054},{"$f":"D33","v":-14.000000000000009},null,null,null,null,{"$f":"H1","v":3.4}]
[null,-8.2000000000000064,118.76800000000017,-24.080000000000013,11,11,"",14,14,null,-3,null,{"$f":"C38","v":26.000000000000032},{"$f":"D38","v":-11.600000000000007}]
[null,-8.0000000000000071,114.00000000000017,-23.600000000000016,11,11,"",14,{"$f":"IF(H13=14,14,G$1*H13+(F$1-G$1*H$1))","v":14},null,-2,null,{"$f":"C43","v":15.600000000000016},{"$f":"D43","v":-9.2000000000000046}]
[null,-7.8000000000000069,109.32800000000016,-23.120000000000019,11,11,"",14,14,null,-1,null,{"$f":"C48","v":7.6000000000000139},{"$f":"D48","v":-6.8000000000000052}]
[null,-7.6000000000000068,104.75200000000015,-22.640000000000015,11,11,"",14,14,null,0,null,{"$f":"C53","v":2.0000000000000089},{"$f":"D53","v":-4.4000000000000057}]
[null,-7.4000000000000066,100.27200000000015,-22.160000000000018,11,11,"",14,14,null,1,null,{"$f":"C58","v":-1.1999999999999966},{"$f":"D58","v":-2.0000000000000053}]
[null,-7.2000000000000064,95.888000000000133,-21.680000000000014,11,11,"",14,14,null,2,null,{"$f":"C63","v":-2.0000000000000009},{"$f":"D63","v":0.39999999999999414},null,null,null,null,"Gradient at 'x'"]
[null,-7.0000000000000062,91.600000000000122,-21.200000000000017,11,11,"",14,14,null,3,null,{"$f":"C68","v":-0.40000000000000391},{"$f":"D68","v":2.7999999999999963},null,null,null,null,{"$f":"G1","v":3.7599999999999962}]
[null,-6.800000000000006,87.408000000000129,-20.720000000000013,11,11,"",14,14,null,4,null,{"$f":"C73","v":3.5999999999999979},{"$f":"D73","v":5.1999999999999975}]
[null,-6.6000000000000059,83.312000000000126,-20.240000000000016,11,11,"",14,14,null,5,null,{"$f":"C78","v":10},{"$f":"D78","v":7.6}]
[null,-6.4000000000000057,79.312000000000111,-19.760000000000012,11,11,"",14,14,null,6,null,{"$f":"C83","v":18.800000000000011},{"$f":"D83","v":10.000000000000002}]
[null,-6.2000000000000055,75.408000000000101,-19.280000000000015,11,11,"",14,14]
[null,-6.0000000000000053,71.600000000000108,-18.800000000000011,11,11,"",14,14]
[null,-5.8000000000000052,67.88800000000009,-18.320000000000014,11,11,"",14,14]
[null,-5.600000000000005,64.272000000000091,-17.840000000000011,11,11,"",14,14]
[null,-5.4000000000000048,60.752000000000081,-17.360000000000014,11,11,"",14,14]
[null,-5.2000000000000046,57.328000000000081,-16.88000000000001,11,11,"",14,14]
[null,-5.0000000000000044,54.000000000000071,-16.400000000000013,11,11,"",14,14]
[null,-4.8000000000000043,50.768000000000072,-15.920000000000011,11,11,"",14,14]
[null,-4.6000000000000041,47.632000000000062,-15.44000000000001,11,11,"",14,14]
[null,-4.4000000000000039,44.592000000000056,-14.96000000000001,11,11,"",14,14]
[null,-4.2000000000000037,41.648000000000053,-14.480000000000009,11,11,"",14,14]
[null,-4.0000000000000036,38.800000000000054,-14.000000000000009,11,11,"",14,14]
[null,-3.8000000000000034,36.048000000000044,-13.520000000000008,11,11,"",14,14]
[null,-3.6000000000000032,33.392000000000039,{"$f":"M$6*3*B35^2+2*P$6*B35+S$6","v":-13.040000000000008},{"$f":"IF((B35-AA$4)^2<0.01,D35,11)","v":11},{"$f":"IF((B35-AA$4)^2<0.01,C35,11)","v":11},"",{"$f":"IF(B35<AA$4-2,14,IF(B35>AA$4+2,14,B35))","v":14},14]
[null,-3.400000000000003,30.832000000000036,-12.560000000000008,11,11,"",14,14]
[null,-3.2000000000000028,28.368000000000038,-12.080000000000007,11,11,"",14,14]
[null,-3.0000000000000027,26.000000000000032,-11.600000000000007,11,11,"",14,14]
[null,-2.8000000000000025,23.72800000000003,-11.120000000000006,11,11,"",14,14]
[null,-2.6000000000000023,21.552000000000028,-10.640000000000006,11,11,"",14,14]
[null,-2.4000000000000021,19.472000000000023,-10.160000000000005,11,11,"",14,14]
[null,-2.200000000000002,17.488000000000021,-9.680000000000005,11,11,"",14,14]
[null,-2.0000000000000018,15.600000000000016,-9.2000000000000046,11,11,"",14,14]
[null,-1.8000000000000018,13.808000000000016,-8.7200000000000042,11,11,"",14,14]
[null,-1.6000000000000019,12.112000000000016,-8.2400000000000055,11,11,"",14,14]
[null,-1.4000000000000019,10.512000000000015,-7.7600000000000051,11,11,"",14,14]
[null,-1.200000000000002,9.0080000000000151,-7.2800000000000047,11,11,"",14,14]
[null,-1.000000000000002,7.6000000000000139,-6.8000000000000052,11,11,"",14,14]
[null,-0.80000000000000204,6.2880000000000136,-6.3200000000000056,11,11,"",14,14]
[null,-0.60000000000000209,5.0720000000000125,-5.8400000000000052,11,11,"",14,14]
[null,-0.40000000000000208,3.9520000000000115,-5.3600000000000056,11,11,"",14,14]
[null,-0.20000000000000207,2.9280000000000102,-4.8800000000000052,11,11,"",14,14]
[null,-2.0539125955565396E-15,2.0000000000000089,-4.4000000000000057,11,11,"",14,14]
[null,0.19999999999999796,1.1680000000000079,-3.9200000000000053,11,11,"",14,14]
[null,0.39999999999999797,0.43200000000000682,-3.4400000000000053,11,11,"",14,14]
[null,0.59999999999999798,-0.20799999999999397,-2.9600000000000053,11,11,"",14,14]
[null,0.79999999999999805,-0.75199999999999534,-2.4800000000000049,11,11,"",14,14]
[null,0.999999999999998,-1.1999999999999966,-2.0000000000000053,11,11,"",14,14]
[null,1.199999999999998,-1.5519999999999974,-1.5200000000000053,11,11,"",14,14]
[null,1.3999999999999979,-1.8079999999999985,-1.0400000000000054,11,11,"",1.3999999999999979,-6.6080000000000059]
[null,1.5999999999999979,-1.9679999999999991,-0.56000000000000583,11,11,"",1.5999999999999979,-5.856000000000007]
[null,1.7999999999999978,-2.032,-8.00000000000054E-2,11,11,"",1.7999999999999978,-5.1040000000000081]
[null,1.9999999999999978,-2.0000000000000009,0.39999999999999414,11,11,"",1.9999999999999978,-4.3520000000000083]
[null,2.199999999999998,-1.8720000000000034,0.87999999999999456,11,11,"",2.199999999999998,-3.6000000000000085]
[null,2.3999999999999981,-1.6480000000000041,1.359999999999995,11,11,"",2.3999999999999981,-2.8480000000000096]
[null,2.5999999999999983,-1.3280000000000047,1.8399999999999954,11,11,"",2.5999999999999983,-2.096000000000009]
[null,2.7999999999999985,-0.91200000000000436,{"$f":"M$6*3*B67^2+2*P$6*B67+S$6","v":2.3199999999999958},{"$f":"IF((B67-AA$4)^2<0.01,D67,11)","v":11},{"$f":"IF((B67-AA$4)^2<0.01,C67,11)","v":11},"",{"$f":"IF(B67<AA$4-2,14,IF(B67>AA$4+2,14,B67))","v":2.7999999999999985},-1.3440000000000083]
[null,2.9999999999999987,{"$f":"(M$6*B68^3+P$6*B68^2+S$6*B68+V$6)","v":-0.40000000000000391},2.7999999999999963,11,11,{"$f":"IF(F68=11,\"\",D68)","v":""},2.9999999999999987,-0.59200000000000941]
[null,{"$f":"B68+0.2","v":3.1999999999999988},0.20799999999999486,3.2799999999999967,11,11,"",3.1999999999999988,0.15999999999999126]
[null,3.399999999999999,0.9119999999999937,3.7599999999999962,3.7599999999999962,0.9119999999999937,3.7599999999999962,3.399999999999999,0.91199999999999015]
[null,3.5999999999999992,1.7119999999999944,4.2399999999999967,11,11,"",3.5999999999999992,1.6639999999999908]
[null,3.7999999999999994,2.607999999999997,4.7199999999999971,11,11,"",3.7999999999999994,2.4159999999999897]
[null,3.9999999999999996,3.5999999999999979,5.1999999999999975,11,11,"",3.9999999999999996,3.1679999999999904]
[null,4.1999999999999993,4.6879999999999953,5.6799999999999979,11,11,"",4.1999999999999993,3.9199999999999893]
[null,4.3999999999999995,5.8719999999999963,6.1599999999999984,11,11,"",4.3999999999999995,4.6719999999999899]
[null,4.5999999999999996,7.1519999999999975,6.6399999999999988,11,11,"",4.5999999999999996,5.4239999999999888]
[null,4.8,8.5279999999999987,7.1199999999999992,11,11,"",4.8,{"$f":"IF(H77=14,14,G$1*H77+(F$1-G$1*H$1))","v":6.1759999999999877}]
[null,5,10,7.6,11,11,"",5,6.9279999999999902]
[null,5.2,11.567999999999998,8.08,11,11,"",5.2,7.6799999999999891]
[null,5.4,13.231999999999999,8.56,11,11,"",5.4,8.4319999999999879]
[null,5.6000000000000005,14.992000000000001,9.0400000000000009,11,11,"",14,14]
[null,5.8000000000000007,16.848000000000003,9.5200000000000014,11,11,"",14,14]
[null,6.0000000000000009,18.800000000000011,10.000000000000002,11,11,"",14,14]
[null,6.2000000000000011,20.848000000000006,10.480000000000002,11,11,"",14,14]
[null,6.4000000000000012,22.992000000000008,10.960000000000003,11,11,"",14,14]
[null,6.6000000000000014,25.23200000000001,11.440000000000003,11,11,"",14,14]
[null,6.8000000000000016,27.568000000000019,11.920000000000003,11,11,"",14,14]
[null,7.0000000000000018,30.000000000000021,12.400000000000004,11,11,"",14,14]
[null,7.200000000000002,32.52800000000002,12.880000000000004,11,11,"",14,14]
[null,7.4000000000000021,35.152000000000022,13.360000000000005,11,11,"",14,14]
[null,7.6000000000000023,37.872000000000028,13.840000000000005,11,11,"",14,14]
[null,7.8000000000000025,40.688000000000024,14.320000000000006,11,11,"",14,14]
[null,8.0000000000000018,43.600000000000016,14.800000000000002,11,11,"",14,14]
[null,8.2000000000000011,46.608000000000025,15.280000000000003,11,11,"",14,14]
[null,8.4,49.711999999999989,15.76,11,11,"",14,14]
[null,8.6,52.911999999999992,16.239999999999995,11,11,"",14,14]
[null,8.7999999999999989,56.207999999999984,16.72,11,11,"",14,14]
[null,8.9999999999999982,59.599999999999966,17.199999999999996,11,11,"",14,14]
[null,9.1999999999999975,63.087999999999951,17.679999999999993,{"$f":"IF((B99-AA$4)^2<0.01,D99,11)","v":11},11,"",14,14]
[null,9.3999999999999968,66.67199999999994,18.159999999999989,{"$f":"IF((B100-AA$4)^2<0.01,D100,11)","v":11},11,"",14,14]
[null,9.5999999999999961,70.351999999999919,18.639999999999986,{"$f":"IF((B101-AA$4)^2<0.01,D101,11)","v":11},11,"",14,14]
[null,9.7999999999999954,74.127999999999901,19.11999999999999,{"$f":"IF((B102-AA$4)^2<0.01,D102,11)","v":11},11,"",14,14]
[null,9.9999999999999947,77.999999999999886,19.599999999999987,{"$f":"IF((B103-AA$4)^2<0.01,D103,11)","v":11},11,"",14,14]

{"sheet":"Gradient Function C","index":2,"n_rows":103,"n_cols":27,"rows_kept":103,"cut":false,"hidden":false,"merged":[[7,13,7,15],[17,10,17,11],[14,13,14,15],[15,13,15,15],[16,13,16,15],[17,13,17,15],[13,10,13,11],[14,10,14,11],[15,10,15,11],[16,10,16,11],[10,10,10,11],[11,10,11,11],[8,10,8,11],[12,10,12,11],[18,10,18,11],[19,10,19,11],[20,10,20,11],[6,13,6,15],[8,13,8,15],[6,12,7,12],[6,10,7,11],[9,13,9,15],[10,13,10,15],[9,10,9,11],[18,13,18,15],[19,13,19,15],[20,13,20,15],[9,18,9,21],[10,18,10,21],[16,18,16,21],[17,18,17,21],[11,13,11,15],[12,13,12,15],[13,13,13,15]]}
[null,null,null,null,null,{"$f":"MIN(F3:F103)","v":-0.56000000000000227},{"$f":"MAX(G3:G103)","v":2.3999999999999977},{"$f":"AA4","v":3.2},null,null,null,null,null,{"$f":"IF(M6=0,\"\",3)","v":""},null,null,{"$f":"IF(P2=\"\",\"\",\"2\")","v":"2"}]
[null,null,null,null,null,null,null,null,null,null,"y","=",{"$f":"IF(M6=0,\"\",M6)","v":""},{"$f":"IF(M6=0,\"\",\"x\")","v":""},{"$f":"IF(P6<0,\"-\",IF(P6=0,\"\",IF(M2=\"\",\"\",\"+\")))","v":""},{"$f":"IF(P6=0,\"\",ABS(P6))","v":1},{"$f":"IF(P2=\"\",\"\",\"x\")","v":"x"},{"$f":"IF(S6<0,\"-\",IF(S6=0,\"\",IF(Q2=\"\",\"\",\"+\")))","v":"-"},{"$f":"IF(S6=0,\"\",ABS(S6))","v":4},{"$f":"IF(S2=\"\",\"\",\"x\")","v":"x"},{"$f":"IF(V6<0,\"-\",IF(V6=0,\"\",\"+\"))","v":"+"},{"$f":"ABS(V6)","v":2}]
[null,-10,{"$f":"(M$6*B3^3+P$6*B3^2+S$6*B3+V$6)","v":142},{"$f":"M$6*3*B3^2+2*P$6*B3+S$6","v":-24},{"$f":"IF((B3-AA$4)^2<0.01,D3,11)","v":11},{"$f":"IF((B3-AA$4)^2<0.01,C3,11)","v":11},{"$f":"IF(F3=11,\"\",D3)","v":""},{"$f":"B3","v":-10},{"$f":"G$1*H3+(F$1-G$1*H$1)","v":-32.239999999999974}]
[null,{"$f":"B3+0.2","v":-9.8000000000000007},137.24,-23.6,11,11,"",{"$f":"B4","v":-9.8000000000000007},{"$f":"G$1*H4+(F$1-G$1*H$1)","v":-31.759999999999973},null,null,null,90,null,null,90,null,null,90,null,null,90,null,null,45,61,{"$f":"(Z4-Y4)/5","v":3.2}]
[null,-9.6000000000000014,132.56000000000003,-23.200000000000003,11,11,"",-9.6000000000000014,-31.279999999999976,null,null,null,90,null,null,100,null,null,50,null,null,110]
[null,-9.4000000000000021,127.96000000000005,-22.800000000000004,11,11,"",-9.4000000000000021,-30.799999999999979,null,null,null,{"$f":"(M5-M4)/10","v":0},null,null,{"$f":"(P5-P4)/10","v":1},null,null,{"$f":"(S5-S4)/10","v":-4},null,null,{"$f":"(V5-V4)/10","v":2}]
[null,-9.2000000000000028,123.44000000000007,-22.400000000000006,11,11,"",-9.2000000000000028,-30.319999999999979,null,"x",null,"y","Gradient"]
[null,-9.0000000000000036,119.00000000000007,-22.000000000000007,11,11,"",-9.0000000000000036,-29.839999999999982,null,null,null,null,"values"]
[null,-8.8000000000000043,114.64000000000009,-21.600000000000009,11,11,"",-8.8000000000000043,-29.359999999999985,null,-6,null,{"$f":"C23","v":62.000000000000085},{"$f":"D23","v":-16.000000000000011}]
[null,-8.600000000000005,110.3600000000001,-21.20000000000001,11,11,"",-8.600000000000005,-28.879999999999988,null,{"$f":"K9+1","v":-5},null,{"$f":"C28","v":47.000000000000057},{"$f":"D28","v":-14.000000000000009},null,null,null,null,"x' value"]
[null,-8.4000000000000057,106.16000000000012,-20.800000000000011,11,11,"",-8.4000000000000057,-28.399999999999988,null,-4,null,{"$f":"C33","v":34.000000000000043},{"$f":"D33","v":-12.000000000000007},null,null,null,null,{"$f":"H1","v":3.2}]
[null,-8.2000000000000064,102.04000000000013,-20.400000000000013,11,11,"",-8.2000000000000064,-27.919999999999991,null,-3,null,{"$f":"C38","v":23.000000000000028},{"$f":"D38","v":-10.000000000000005}]
[null,-8.0000000000000071,98.000000000000142,-20.000000000000014,11,11,"",-8.0000000000000071,-27.439999999999994,null,-2,null,{"$f":"C43","v":14.000000000000014},{"$f":"D43","v":-8.0000000000000036}]
[null,-7.8000000000000069,94.040000000000134,-19.600000000000016,11,11,"",-7.8000000000000069,-26.959999999999994,null,-1,null,{"$f":"C48","v":7.0000000000000124},{"$f":"D48","v":-6.0000000000000036}]
[null,-7.6000000000000068,90.160000000000139,-19.200000000000014,11,11,"",-7.6000000000000068,-26.479999999999993,null,0,null,{"$f":"C53","v":2.000000000000008},{"$f":"D53","v":-4.0000000000000044}]
[null,-7.4000000000000066,86.360000000000127,-18.800000000000011,11,11,"",-7.4000000000000066,-25.999999999999993,null,1,null,{"$f":"C58","v":-0.999999999999996},{"$f":"D58","v":-2.000000000000004}]
[null,-7.2000000000000064,82.640000000000114,-18.400000000000013,11,11,"",-7.2000000000000064,-25.519999999999992,null,2,null,{"$f":"C63","v":-2},{"$f":"D63","v":-4.4408920985006262E-15},null,null,null,null,"Gradient at 'x'"]
[null,-7.0000000000000062,79.000000000000114,-18.000000000000014,11,11,"",-7.0000000000000062,-25.039999999999992,null,3,null,{"$f":"C68","v":-1.0000000000000018},{"$f":"D68","v":1.9999999999999973},null,null,null,null,{"$f":"G1","v":2.3999999999999977}]
[null,-6.800000000000006,75.440000000000111,-17.600000000000012,11,11,"",-6.800000000000006,-24.559999999999995,null,4,null,{"$f":"C73","v":1.9999999999999982},{"$f":"D73","v":3.9999999999999991}]
[null,-6.6000000000000059,71.960000000000107,-17.20000000000001,11,11,"",-6.6000000000000059,-24.079999999999991,null,5,null,{"$f":"C78","v":7},{"$f":"D78","v":6}]
[null,-6.4000000000000057,68.560000000000088,-16.800000000000011,11,11,"",-6.4000000000000057,-23.599999999999994,null,6,null,{"$f":"C83","v":14.000000000000011},{"$f":"D83","v":8.0000000000000018}]
[null,-6.2000000000000055,65.240000000000094,-16.400000000000013,11,11,"",-6.2000000000000055,-23.119999999999994]
[null,-6.0000000000000053,62.000000000000085,-16.000000000000011,11,11,"",-6.0000000000000053,-22.639999999999993]
[null,-5.8000000000000052,58.840000000000074,-15.60000000000001,11,11,"",-5.8000000000000052,-22.159999999999993]
[null,-5.600000000000005,55.760000000000076,-15.20000000000001,11,11,"",-5.600000000000005,-21.679999999999993]
[null,-5.4000000000000048,52.760000000000076,-14.80000000000001,11,11,"",-5.4000000000000048,-21.199999999999996]
[null,-5.2000000000000046,49.840000000000067,-14.400000000000009,11,11,"",-5.2000000000000046,-20.719999999999992]
[null,-5.0000000000000044,47.000000000000057,-14.000000000000009,11,11,"",-5.0000000000000044,-20.239999999999995]
[null,-4.8000000000000043,44.240000000000059,-13.600000000000009,11,11,"",-4.8000000000000043,-19.759999999999994]
[null,-4.6000000000000041,41.560000000000059,-13.200000000000008,11,11,"",-4.6000000000000041,-19.279999999999994]
[null,-4.4000000000000039,38.960000000000051,-12.800000000000008,11,11,"",-4.4000000000000039,-18.799999999999994]
[null,-4.2000000000000037,36.440000000000047,-12.400000000000007,11,11,"",-4.2000000000000037,-18.319999999999993]
[null,-4.0000000000000036,34.000000000000043,-12.000000000000007,11,11,"",-4.0000000000000036,-17.839999999999996]
[null,-3.8000000000000034,31.64000000000004,-11.600000000000007,11,11,"",-3.8000000000000034,-17.359999999999992]
[null,-3.6000000000000032,{"$f":"(M$6*B35^3+P$6*B35^2+S$6*B35+V$6)","v":29.360000000000035},{"$f":"M$6*3*B35^2+2*P$6*B35+S$6","v":-11.200000000000006},{"$f":"IF((B35-AA$4)^2<0.01,D35,11)","v":11},{"$f":"IF((B35-AA$4)^2<0.01,C35,11)","v":11},{"$f":"IF(F35=11,\"\",D35)","v":""},-3.6000000000000032,-16.879999999999995]
[null,{"$f":"B35+0.2","v":-3.400000000000003},27.160000000000032,-10.800000000000006,11,11,"",-3.400000000000003,-16.399999999999995]
[null,-3.2000000000000028,25.040000000000028,-10.400000000000006,11,11,"",-3.2000000000000028,-15.919999999999995]
[null,-3.0000000000000027,23.000000000000028,-10.000000000000005,11,11,"",-3.0000000000000027,-15.439999999999994]
[null,-2.8000000000000025,21.040000000000024,-9.600000000000005,11,11,"",-2.8000000000000025,-14.959999999999994]
[null,-2.6000000000000023,19.160000000000021,-9.2000000000000046,11,11,"",-2.6000000000000023,-14.479999999999993]
[null,-2.4000000000000021,17.360000000000021,-8.8000000000000043,11,11,"",-2.4000000000000021,-13.999999999999995]
[null,-2.200000000000002,15.640000000000017,-8.4000000000000039,11,11,"",-2.200000000000002,-13.519999999999994]
[null,-2.0000000000000018,14.000000000000014,-8.0000000000000036,11,11,"",-2.0000000000000018,-13.039999999999996]
[null,-1.8000000000000018,12.440000000000014,-7.6000000000000032,11,11,"",-1.8000000000000018,-12.559999999999995]
[null,-1.6000000000000019,10.960000000000013,-7.2000000000000037,11,11,"",-1.6000000000000019,-12.079999999999995]
[null,-1.4000000000000019,9.5600000000000129,-6.8000000000000043,11,11,"",-1.4000000000000019,-11.599999999999996]
[null,-1.200000000000002,8.2400000000000126,-6.4000000000000039,11,11,"",-1.200000000000002,-11.119999999999997]
[null,-1.000000000000002,7.0000000000000124,-6.0000000000000036,11,11,"",-1.000000000000002,-10.639999999999997]
[null,-0.80000000000000204,5.8400000000000114,-5.6000000000000041,11,11,"",-0.80000000000000204,-10.159999999999998]
[null,-0.60000000000000209,4.7600000000000104,-5.2000000000000046,11,11,"",-0.60000000000000209,-9.6799999999999979]
[null,-0.40000000000000208,3.76000000000001,-4.8000000000000043,11,11,"",-0.40000000000000208,-9.1999999999999993]
[null,-0.20000000000000207,2.8400000000000092,-4.4000000000000039,11,11,"",-0.20000000000000207,-8.7199999999999989]
[null,-2.0539125955565396E-15,2.000000000000008,-4.0000000000000044,11,11,"",-2.0539125955565396E-15,-8.24]
[null,0.19999999999999796,1.2400000000000073,-3.6000000000000041,11,11,"",0.19999999999999796,-7.76]
[null,0.39999999999999797,0.56000000000000649,-3.2000000000000042,11,11,"",0.39999999999999797,-7.2800000000000011]
[null,0.59999999999999798,-3.9999999999994262E-2,-2.8000000000000043,11,11,"",0.59999999999999798,-6.8000000000000007]
[null,0.79999999999999805,-0.55999999999999517,-2.4000000000000039,11,11,"",0.79999999999999805,-6.3200000000000012]
[null,0.999999999999998,-0.999999999999996,-2.000000000000004,11,11,"",0.999999999999998,-5.8400000000000016]
[null,1.199999999999998,-1.3599999999999968,-1.6000000000000041,11,11,"",1.199999999999998,-5.360000000000003]
[null,1.3999999999999979,-1.6399999999999975,-1.2000000000000042,11,11,"",1.3999999999999979,-4.8800000000000026]
[null,1.5999999999999979,-1.8399999999999981,-0.80000000000000426,11,11,"",1.5999999999999979,-4.4000000000000039]
[null,1.7999999999999978,-1.9599999999999991,-0.40000000000000435,11,11,"",1.7999999999999978,-3.9200000000000044]
[null,1.9999999999999978,-2,-4.4408920985006262E-15,11,11,"",1.9999999999999978,-3.4400000000000048]
[null,2.199999999999998,-1.9600000000000009,0.39999999999999591,11,11,"",2.199999999999998,-2.9600000000000053]
[null,2.3999999999999981,-1.8400000000000016,0.79999999999999627,11,11,"",2.3999999999999981,-2.4800000000000049]
[null,2.5999999999999983,-1.6400000000000023,1.1999999999999966,11,11,"",2.5999999999999983,-2.0000000000000053]
[null,2.7999999999999985,{"$f":"(M$6*B67^3+P$6*B67^2+S$6*B67+V$6)","v":-1.3600000000000021},{"$f":"M$6*3*B67^2+2*P$6*B67+S$6","v":1.599999999999997},{"$f":"IF((B67-AA$4)^2<0.01,D67,11)","v":11},{"$f":"IF((B67-AA$4)^2<0.01,C67,11)","v":11},{"$f":"IF(F67=11,\"\",D67)","v":""},2.7999999999999985,-1.5200000000000049]
[null,{"$f":"B67+0.2","v":2.9999999999999987},-1.0000000000000018,1.9999999999999973,11,11,"",{"$f":"B68","v":2.9999999999999987},{"$f":"G$1*H68+(F$1-G$1*H$1)","v":-1.0400000000000054}]
[null,3.1999999999999988,-0.56000000000000227,2.3999999999999977,2.3999999999999977,-0.56000000000000227,2.3999999999999977,3.1999999999999988,-0.56000000000000494]
[null,3.399999999999999,-4.00000000000027E-2,2.799999999999998,11,11,"",3.399999999999999,-8.00000000000054E-2]
[null,3.5999999999999992,0.55999999999999694,3.1999999999999984,11,11,"",3.5999999999999992,0.39999999999999503]
[null,3.7999999999999994,1.2399999999999984,3.5999999999999988,11,11,"",3.7999999999999994,0.87999999999999545]
[null,3.9999999999999996,1.9999999999999982,3.9999999999999991,11,11,"",3.9999999999999996,1.3599999999999941]
[null,4.1999999999999993,2.8399999999999963,4.3999999999999986,11,11,"",4.1999999999999993,1.8399999999999945]
[null,4.3999999999999995,3.759999999999998,4.7999999999999989,11,11,"",4.3999999999999995,2.3199999999999932]
[null,4.5999999999999996,4.759999999999998,5.1999999999999993,11,11,"",4.5999999999999996,2.7999999999999936]
[null,4.8,5.84,5.6,11,11,"",4.8,3.279999999999994]
[null,5,7,6,11,11,"",5,3.7599999999999945]
[null,5.2,8.240000000000002,6.4,11,11,"",5.2,4.2399999999999931]
[null,5.4,9.5600000000000023,6.8000000000000007,11,11,"",5.4,4.7199999999999935]
[null,5.6000000000000005,10.960000000000004,7.2000000000000011,11,11,"",5.6000000000000005,5.199999999999994]
[null,5.8000000000000007,12.440000000000005,7.6000000000000014,11,11,"",5.8000000000000007,5.6799999999999926]
[null,6.0000000000000009,14.000000000000011,8.0000000000000018,11,11,"",6.0000000000000009,6.159999999999993]
[null,6.2000000000000011,15.640000000000008,8.4000000000000021,11,11,"",6.2000000000000011,6.6399999999999935]
[null,6.4000000000000012,17.36000000000001,8.8000000000000025,11,11,"",6.4000000000000012,7.1199999999999939]
[null,6.6000000000000014,19.160000000000011,9.2000000000000028,11,11,"",6.6000000000000014,7.5999999999999925]
[null,6.8000000000000016,21.040000000000017,9.6000000000000032,11,11,"",6.8000000000000016,8.0799999999999947]
[null,7.0000000000000018,23.000000000000021,10.000000000000004,11,11,"",7.0000000000000018,8.5599999999999916]
[null,7.200000000000002,25.040000000000017,10.400000000000004,11,11,"",7.200000000000002,9.039999999999992]
[null,7.4000000000000021,27.160000000000025,10.800000000000004,11,11,"",7.4000000000000021,9.5199999999999925]
[null,7.6000000000000023,29.360000000000024,11.200000000000005,11,11,"",7.6000000000000023,9.9999999999999929]
[null,7.8000000000000025,31.640000000000029,11.600000000000005,11,11,"",7.8000000000000025,10.479999999999993]
[null,8.0000000000000018,34.000000000000021,12.000000000000004,11,11,"",8.0000000000000018,10.95999999999999]
[null,8.2000000000000011,36.440000000000019,12.400000000000002,11,11,"",8.2000000000000011,11.439999999999987]
[null,8.4,38.96,12.8,11,11,"",8.4,11.919999999999987]
[null,8.6,41.559999999999995,13.2,11,11,"",8.6,12.399999999999984]
[null,8.7999999999999989,44.239999999999988,13.599999999999998,11,11,"",8.7999999999999989,12.879999999999981]
[null,8.9999999999999982,46.999999999999979,13.999999999999996,11,11,"",8.9999999999999982,13.359999999999982]
[null,9.1999999999999975,{"$f":"(M$6*B99^3+P$6*B99^2+S$6*B99+V$6)","v":49.839999999999968},14.399999999999995,{"$f":"IF((B99-AA$4)^2<0.01,D99,11)","v":11},11,{"$f":"IF(F99=11,\"\",D99)","v":""},9.1999999999999975,13.839999999999979]
[null,9.3999999999999968,{"$f":"(M$6*B100^3+P$6*B100^2+S$6*B100+V$6)","v":52.759999999999955},14.799999999999994,{"$f":"IF((B100-AA$4)^2<0.01,D100,11)","v":11},11,{"$f":"IF(F100=11,\"\",D100)","v":""},9.3999999999999968,14.319999999999975]
[null,9.5999999999999961,{"$f":"(M$6*B101^3+P$6*B101^2+S$6*B101+V$6)","v":55.759999999999941},15.199999999999992,{"$f":"IF((B101-AA$4)^2<0.01,D101,11)","v":11},11,{"$f":"IF(F101=11,\"\",D101)","v":""},9.5999999999999961,14.799999999999972]
[null,9.7999999999999954,{"$f":"(M$6*B102^3+P$6*B102^2+S$6*B102+V$6)","v":58.839999999999925},15.599999999999991,{"$f":"IF((B102-AA$4)^2<0.01,D102,11)","v":11},11,{"$f":"IF(F102=11,\"\",D102)","v":""},9.7999999999999954,15.279999999999973]
[null,9.9999999999999947,{"$f":"(M$6*B103^3+P$6*B103^2+S$6*B103+V$6)","v":61.999999999999908},15.999999999999989,{"$f":"IF((B103-AA$4)^2<0.01,D103,11)","v":11},11,{"$f":"IF(F103=11,\"\",D103)","v":""},9.9999999999999947,15.75999999999997]

{"sheet":"Sheet2","index":3,"n_rows":0,"n_cols":0,"rows_kept":0,"cut":false,"hidden":false,"merged":[]}

{"sheet":"Sheet3","index":4,"n_rows":0,"n_cols":0,"rows_kept":0,"cut":false,"hidden":false,"merged":[]}