{"text_format":"1","workbook":"xlsx","n_sheets":4,"sheets":["Coin Flip by flip","Repeating Coin Flips","Sheet2","Sheet3"],"not_rendered":{"charts":6,"images":1,"macros":1,"external_links":0,"defined_names":0,"comments":0,"pivot_tables":0},"unopened":[],"bounds":{"document_bytes":16777216,"sheet_cells":100000,"rows_first":2000,"rows_last":500,"rows_between":2000,"halvings":0,"cell_chars":16384,"cell_head_chars":4096},"cells_cut":0,"cells_raw":0,"read":"whole","date_system":"1900"}

{"sheet":"Coin Flip by flip","index":0,"n_rows":503,"n_cols":41,"rows_kept":503,"cut":false,"hidden":false,"merged":[]}
[null,null,null,null,null,null,null,"Coin Flips =",{"$f":"I2-1","v":0},null,null,0,{"$f":"L1+1","v":1},2,3,4,5,6,7,8,9,10,11,12,13,14,15,16,17,18,19,20,21,22,23,24,25,26,27,28,29]
[null,null,null,null,null,null,null,null,1]
[null,null,null,null,null,"Flip","Result","H's so far","P(Head)"]
[{"$f":"IF(B4=\"\",\"\",A3+B4)","v":""},{"$f":"IF(F4<I$2,C4,\"\")","v":""},1,"H",null,1,{"$f":"IF(H4=\"\",\"\",D4)","v":""},{"$f":"A4","v":""},{"$f":"IF(B4=\"\",\"\",H4/F4)","v":""}]
[{"$f":"IF(B5=\"\",\"\",A4+B5)","v":""},"",0,"T",null,2,{"$f":"IF(H5=\"\",\"\",D5)","v":""},"",{"$f":"IF(B5=\"\",\"\",H5/F5)","v":""}]
[{"$f":"IF(B6=\"\",\"\",A5+B6)","v":""},"",1,"H",null,3,"","",{"$f":"IF(B6=\"\",\"\",H6/F6)","v":""}]
["","",0,"T",null,4,"","",""]
["","",1,"H",null,5,"","",""]
["","",1,"H",null,6,"","",""]
["","",0,"T",null,7,"","",""]
["","",0,"T",null,8,"","",""]
["","",0,"T",null,9,"","",""]
["","",1,"H",null,10,"","",""]
["","",1,"H",null,11,"","",""]
[{"$f":"IF(B15=\"\",\"\",A14+B15)","v":""},"",1,"H",null,12,"","",""]
["","",0,"T",null,13,"","",""]
["","",0,"T",null,14,"","",""]
["","",0,"T",null,15,"","",""]
["","",1,"H",null,16,"","",""]
["","",0,"T",null,17,"","",""]
["","",0,"T",null,18,"","",""]
["","",0,"T",null,19,"","",""]
[{"$f":"IF(B23=\"\",\"\",A22+B23)","v":""},"",1,"H",null,20,"",{"$f":"A23","v":""},{"$f":"IF(B23=\"\",\"\",H23/F23)","v":""}]
["","",1,"H",null,21,"","",""]
["","",1,"H",null,22,"","",""]
["","",0,"T",null,23,"","",""]
["","",0,"T",null,24,"","",""]
["","",0,"T",null,25,"","",""]
["","",0,"T",null,26,"","",""]
["","",1,"H",null,27,"","",""]
["","",0,"T",null,28,"","",""]
["","",0,"T",null,29,"","",""]
["","",0,"T",null,30,"","",""]
["","",1,"H",null,31,"","",""]
["","",1,"H",null,32,"","",""]
["","",1,"H",null,33,"","",""]
["","",0,"T",null,34,"","",""]
["","",1,"H",null,35,"","",""]
["","",1,"H",null,36,"","",""]
["","",1,"H",null,37,"","",""]
["","",0,"T",null,38,"","",""]
["","",0,"T",null,39,"","",""]
["","",1,"H",null,40,"","",""]
["","",0,"T",null,41,"","",""]
["","",0,"T",null,42,"","",""]
["","",1,"H",null,43,"","",""]
["","",1,"H",null,44,"","",""]
["","",1,"H",null,45,"","",""]
["","",1,"H",null,46,"","",""]
["","",0,"T",null,47,"","",""]
["","",1,"H",null,48,"","",""]
["","",1,"H",null,49,"","",""]
["","",1,"H",null,50,"","",""]
["","",1,"H",null,51,"","",""]
["","",0,"T",null,52,"","",""]
["","",0,"T",null,53,"","",""]
["","",1,"H",null,54,"","",""]
["","",0,"T",null,55,"","",""]
["","",1,"H",null,56,"","",""]
["","",1,"H",null,57,"","",""]
["","",1,"H",null,58,"","",""]
["","",1,"H",null,59,"","",""]
["","",1,"H",null,60,"","",""]
["","",1,"H",null,61,"","",""]
["","",1,"H",null,62,"","",""]
["","",1,"H",null,63,"","",""]
["","",1,"H",null,64,"","",""]
["",{"$f":"IF(F68<I$2,C68,\"\")","v":""},1,"H",null,65,"","",""]
["","",1,"H",null,66,{"$f":"IF(H69=\"\",\"\",D69)","v":""},"",""]
["","",0,"T",null,67,"","",""]
["","",1,"H",null,68,"","",""]
["","",0,"T",null,69,"","",""]
["","",1,"H",null,70,"","",""]
["","",1,"H",null,71,"","",""]
["","",1,"H",null,72,"","",""]
["","",1,"H",null,73,"","",""]
["","",0,"T",null,74,"","",""]
["","",0,"T",null,75,"","",""]
["","",0,"T",null,76,"","",""]
["","",1,"H",null,77,"","",""]
["","",1,"H",null,78,"","",""]
["","",1,"H",null,79,"","",""]
["","",1,"H",null,80,"","",""]
["","",1,"H",null,81,"","",""]
["","",1,"H",null,82,"","",""]
["","",0,"T",null,83,"","",""]
[{"$f":"IF(B87=\"\",\"\",A86+B87)","v":""},"",0,"T",null,84,"",{"$f":"A87","v":""},{"$f":"IF(B87=\"\",\"\",H87/F87)","v":""}]
["","",0,"T",null,85,"","",""]
["","",1,"H",null,86,"","",""]
["","",0,"T",null,87,"","",""]
["","",1,"H",null,88,"","",""]
["","",0,"T",null,89,"","",""]
["","",0,"T",null,90,"","",""]
["","",1,"H",null,91,"","",""]
["","",0,"T",null,92,"","",""]
["","",1,"H",null,93,"","",""]
["","",1,"H",null,94,"","",""]
["","",1,"H",null,95,"","",""]
["","",0,"T",null,96,"","",""]
["","",1,"H",null,97,"","",""]
["","",0,"T",null,98,"","",""]
["","",0,"T",null,99,"","",""]
["","",0,"T",null,100,"","",""]
["","",0,"T",null,101,"","",""]
["","",0,"T",null,102,"","",""]
["","",0,"T",null,103,"","",""]
["","",0,"T",null,104,"","",""]
["","",1,"H",null,105,"","",""]
["","",1,"H",null,106,"","",""]
["","",1,"H",null,107,"","",""]
["","",1,"H",null,108,"","",""]
["","",1,"H",null,109,"","",""]
["","",1,"H",null,110,"","",""]
["","",1,"H",null,111,"","",""]
["","",1,"H",null,112,"","",""]
["","",1,"H",null,113,"","",""]
["","",0,"T",null,114,"","",""]
["","",0,"T",null,115,"","",""]
["","",1,"H",null,116,"","",""]
["","",0,"T",null,117,"","",""]
["","",0,"T",null,118,"","",""]
["","",0,"T",null,119,"","",""]
["","",0,"T",null,120,"","",""]
["","",0,"T",null,121,"","",""]
["","",1,"H",null,122,"","",""]
["","",1,"H",null,123,"","",""]
["","",0,"T",null,124,"","",""]
["","",1,"H",null,125,"","",""]
["","",1,"H",null,126,"","",""]
["","",0,"T",null,127,"","",""]
["","",1,"H",null,128,"","",""]
["",{"$f":"IF(F132<I$2,C132,\"\")","v":""},0,"T",null,129,"","",""]
["","",1,"H",null,130,{"$f":"IF(H133=\"\",\"\",D133)","v":""},"",""]
["","",0,"T",null,131,"","",""]
["","",0,"T",null,132,"","",""]
["","",1,"H",null,133,"","",""]
["","",1,"H",null,134,"","",""]
["","",0,"T",null,135,"","",""]
["","",0,"T",null,136,"","",""]
["","",0,"T",null,137,"","",""]
["","",1,"H",null,138,"","",""]
["","",1,"H",null,139,"","",""]
["","",0,"T",null,140,"","",""]
["","",0,"T",null,141,"","",""]
["","",0,"T",null,142,"","",""]
["","",1,"H",null,143,"","",""]
["","",1,"H",null,144,"","",""]
["","",1,"H",null,145,"","",""]
["","",1,"H",null,146,"","",""]
["","",0,"T",null,147,"","",""]
[{"$f":"IF(B151=\"\",\"\",A150+B151)","v":""},"",1,"H",null,148,"",{"$f":"A151","v":""},{"$f":"IF(B151=\"\",\"\",H151/F151)","v":""}]
["","",0,"T",null,149,"","",""]
["","",0,"T",null,150,"","",""]
["","",1,"H",null,151,"","",""]
["","",1,"H",null,152,"","",""]
["","",0,"T",null,153,"","",""]
["","",1,"H",null,154,"","",""]
["","",1,"H",null,155,"","",""]
["","",1,"H",null,156,"","",""]
["","",1,"H",null,157,"","",""]
["","",0,"T",null,158,"","",""]
["","",0,"T",null,159,"","",""]
["","",1,"H",null,160,"","",""]
["","",0,"T",null,161,"","",""]
["","",0,"T",null,162,"","",""]
["","",0,"T",null,163,"","",""]
["","",0,"T",null,164,"","",""]
["","",1,"H",null,165,"","",""]
["","",1,"H",null,166,"","",""]
["","",1,"H",null,167,"","",""]
["","",1,"H",null,168,"","",""]
["","",1,"H",null,169,"","",""]
["","",1,"H",null,170,"","",""]
["","",1,"H",null,171,"","",""]
["","",1,"H",null,172,"","",""]
["","",1,"H",null,173,"","",""]
["","",0,"T",null,174,"","",""]
["","",1,"H",null,175,"","",""]
["","",0,"T",null,176,"","",""]
["","",1,"H",null,177,"","",""]
["","",0,"T",null,178,"","",""]
["","",1,"H",null,179,"","",""]
["","",1,"H",null,180,"","",""]
["","",0,"T",null,181,"","",""]
["","",0,"T",null,182,"","",""]
["","",0,"T",null,183,"","",""]
["","",1,"H",null,184,"","",""]
["","",0,"T",null,185,"","",""]
["","",0,"T",null,186,"","",""]
["","",0,"T",null,187,"","",""]
["","",0,"T",null,188,"","",""]
["","",1,"H",null,189,"","",""]
["","",0,"T",null,190,"","",""]
["","",1,"H",null,191,"","",""]
["","",0,"T",null,192,"","",""]
["",{"$f":"IF(F196<I$2,C196,\"\")","v":""},1,"H",null,193,"","",""]
["","",1,"H",null,194,{"$f":"IF(H197=\"\",\"\",D197)","v":""},"",""]
["","",0,"T",null,195,"","",""]
["","",0,"T",null,196,"","",""]
["","",1,"H",null,197,"","",""]
["","",1,"H",null,198,"","",""]
["","",1,"H",null,199,"","",""]
["","",1,"H",null,200,"","",""]
["","",1,"H",null,201,"","",""]
["","",0,"T",null,202,"","",""]
["","",1,"H",null,203,"","",""]
["","",1,"H",null,204,"","",""]
["","",1,"H",null,205,"","",""]
["","",1,"H",null,206,"","",""]
["","",0,"T",null,207,"","",""]
["","",0,"T",null,208,"","",""]
["","",1,"H",null,209,"","",""]
["","",0,"T",null,210,"","",""]
["","",0,"T",null,211,"","",""]
[{"$f":"IF(B215=\"\",\"\",A214+B215)","v":""},"",0,"T",null,212,"",{"$f":"A215","v":""},{"$f":"IF(B215=\"\",\"\",H215/F215)","v":""}]
["","",1,"H",null,213,"","",""]
["","",0,"T",null,214,"","",""]
["","",1,"H",null,215,"","",""]
["","",1,"H",null,216,"","",""]
["","",0,"T",null,217,"","",""]
["","",1,"H",null,218,"","",""]
["","",1,"H",null,219,"","",""]
["","",1,"H",null,220,"","",""]
["","",1,"H",null,221,"","",""]
["","",0,"T",null,222,"","",""]
["","",1,"H",null,223,"","",""]
["","",0,"T",null,224,"","",""]
["","",1,"H",null,225,"","",""]
["","",1,"H",null,226,"","",""]
["","",1,"H",null,227,"","",""]
["","",1,"H",null,228,"","",""]
["","",1,"H",null,229,"","",""]
["","",0,"T",null,230,"","",""]
["","",1,"H",null,231,"","",""]
["","",1,"H",null,232,"","",""]
["","",0,"T",null,233,"","",""]
["","",1,"H",null,234,"","",""]
["","",1,"H",null,235,"","",""]
["","",0,"T",null,236,"","",""]
["","",1,"H",null,237,"","",""]
["","",1,"H",null,238,"","",""]
["","",0,"T",null,239,"","",""]
["","",0,"T",null,240,"","",""]
["","",0,"T",null,241,"","",""]
["","",0,"T",null,242,"","",""]
["","",1,"H",null,243,"","",""]
["","",1,"H",null,244,"","",""]
["","",1,"H",null,245,"","",""]
["","",0,"T",null,246,"","",""]
["","",0,"T",null,247,"","",""]
["","",1,"H",null,248,"","",""]
["","",1,"H",null,249,"","",""]
["","",1,"H",null,250,"","",""]
["","",0,"T",null,251,"","",""]
["","",0,"T",null,252,"","",""]
["","",0,"T",null,253,"","",""]
["","",1,"H",null,254,"","",""]
["","",1,"H",null,255,"","",""]
["","",0,"T",null,256,"","",""]
["",{"$f":"IF(F260<I$2,C260,\"\")","v":""},0,"T",null,257,"","",""]
["","",0,"T",null,258,{"$f":"IF(H261=\"\",\"\",D261)","v":""},"",""]
["","",0,"T",null,259,"","",""]
["","",0,"T",null,260,"","",""]
["","",0,"T",null,261,"","",""]
["","",1,"H",null,262,"","",""]
["","",1,"H",null,263,"","",""]
["","",0,"T",null,264,"","",""]
["","",1,"H",null,265,"","",""]
["","",0,"T",null,266,"","",""]
["","",0,"T",null,267,"","",""]
["","",0,"T",null,268,"","",""]
["","",1,"H",null,269,"","",""]
["","",0,"T",null,270,"","",""]
["","",1,"H",null,271,"","",""]
["","",1,"H",null,272,"","",""]
["","",1,"H",null,273,"","",""]
["","",0,"T",null,274,"","",""]
["","",1,"H",null,275,"","",""]
[{"$f":"IF(B279=\"\",\"\",A278+B279)","v":""},"",1,"H",null,276,"",{"$f":"A279","v":""},{"$f":"IF(B279=\"\",\"\",H279/F279)","v":""}]
["","",0,"T",null,277,"","",""]
["","",0,"T",null,278,"","",""]
["","",1,"H",null,279,"","",""]
["","",1,"H",null,280,"","",""]
["","",0,"T",null,281,"","",""]
["","",1,"H",null,282,"","",""]
["","",1,"H",null,283,"","",""]
["","",0,"T",null,284,"","",""]
["","",0,"T",null,285,"","",""]
["","",1,"H",null,286,"","",""]
["","",0,"T",null,287,"","",""]
["","",1,"H",null,288,"","",""]
["","",0,"T",null,289,"","",""]
["","",0,"T",null,290,"","",""]
["","",0,"T",null,291,"","",""]
["","",0,"T",null,292,"","",""]
["","",1,"H",null,293,"","",""]
["","",1,"H",null,294,"","",""]
["","",0,"T",null,295,"","",""]
["","",1,"H",null,296,"","",""]
["","",1,"H",null,297,"","",""]
["","",1,"H",null,298,"","",""]
["","",1,"H",null,299,"","",""]
["","",1,"H",null,300,"","",""]
["","",0,"T",null,301,"","",""]
["","",0,"T",null,302,"","",""]
["","",1,"H",null,303,"","",""]
["","",1,"H",null,304,"","",""]
["","",0,"T",null,305,"","",""]
["","",0,"T",null,306,"","",""]
["","",1,"H",null,307,"","",""]
["","",1,"H",null,308,"","",""]
["","",0,"T",null,309,"","",""]
["","",1,"H",null,310,"","",""]
["","",1,"H",null,311,"","",""]
["","",1,"H",null,312,"","",""]
["","",0,"T",null,313,"","",""]
["","",0,"T",null,314,"","",""]
["","",1,"H",null,315,"","",""]
["","",0,"T",null,316,"","",""]
["","",0,"T",null,317,"","",""]
["","",0,"T",null,318,"","",""]
["","",1,"H",null,319,"","",""]
["","",0,"T",null,320,"","",""]
["",{"$f":"IF(F324<I$2,C324,\"\")","v":""},0,"T",null,321,"","",""]
["","",1,"H",null,322,{"$f":"IF(H325=\"\",\"\",D325)","v":""},"",""]
["","",1,"H",null,323,"","",""]
["","",0,"T",null,324,"","",""]
["","",0,"T",null,325,"","",""]
["","",0,"T",null,326,"","",""]
["","",1,"H",null,327,"","",""]
["","",0,"T",null,328,"","",""]
["","",0,"T",null,329,"","",""]
["","",1,"H",null,330,"","",""]
["","",0,"T",null,331,"","",""]
["","",1,"H",null,332,"","",""]
["","",0,"T",null,333,"","",""]
["","",0,"T",null,334,"","",""]
["","",0,"T",null,335,"","",""]
["","",0,"T",null,336,"","",""]
["","",0,"T",null,337,"","",""]
["","",0,"T",null,338,"","",""]
["","",0,"T",null,339,"","",""]
[{"$f":"IF(B343=\"\",\"\",A342+B343)","v":""},"",1,"H",null,340,"",{"$f":"A343","v":""},{"$f":"IF(B343=\"\",\"\",H343/F343)","v":""}]
["","",1,"H",null,341,"","",""]
["","",0,"T",null,342,"","",""]
["","",1,"H",null,343,"","",""]
["","",0,"T",null,344,"","",""]
["","",0,"T",null,345,"","",""]
["","",1,"H",null,346,"","",""]
["","",0,"T",null,347,"","",""]
["","",1,"H",null,348,"","",""]
["","",0,"T",null,349,"","",""]
["","",0,"T",null,350,"","",""]
["","",1,"H",null,351,"","",""]
["","",1,"H",null,352,"","",""]
["","",1,"H",null,353,"","",""]
["","",0,"T",null,354,"","",""]
["","",0,"T",null,355,"","",""]
["","",1,"H",null,356,"","",""]
["","",0,"T",null,357,"","",""]
["","",0,"T",null,358,"","",""]
["","",0,"T",null,359,"","",""]
["","",1,"H",null,360,"","",""]
["","",0,"T",null,361,"","",""]
["","",1,"H",null,362,"","",""]
["","",0,"T",null,363,"","",""]
["","",1,"H",null,364,"","",""]
["","",1,"H",null,365,"","",""]
["","",0,"T",null,366,"","",""]
["","",0,"T",null,367,"","",""]
["","",0,"T",null,368,"","",""]
["","",1,"H",null,369,"","",""]
["","",0,"T",null,370,"","",""]
["","",0,"T",null,371,"","",""]
["","",0,"T",null,372,"","",""]
["","",0,"T",null,373,"","",""]
["","",0,"T",null,374,"","",""]
["","",0,"T",null,375,"","",""]
["","",0,"T",null,376,"","",""]
["","",0,"T",null,377,"","",""]
["","",0,"T",null,378,"","",""]
["","",1,"H",null,379,"","",""]
["","",1,"H",null,380,"","",""]
["","",1,"H",null,381,"","",""]
["","",0,"T",null,382,"","",""]
["","",0,"T",null,383,"","",""]
["","",1,"H",null,384,"","",""]
["",{"$f":"IF(F388<I$2,C388,\"\")","v":""},1,"H",null,385,"","",""]
["","",0,"T",null,386,{"$f":"IF(H389=\"\",\"\",D389)","v":""},"",""]
["","",0,"T",null,387,"","",""]
["","",0,"T",null,388,"","",""]
["","",0,"T",null,389,"","",""]
["","",0,"T",null,390,"","",""]
["","",1,"H",null,391,"","",""]
["","",1,"H",null,392,"","",""]
["","",0,"T",null,393,"","",""]
["","",0,"T",null,394,"","",""]
["","",1,"H",null,395,"","",""]
["","",1,"H",null,396,"","",""]
["","",1,"H",null,397,"","",""]
["","",0,"T",null,398,"","",""]
["","",0,"T",null,399,"","",""]
["","",0,"T",null,400,"","",""]
["","",1,"H",null,401,"","",""]
["","",1,"H",null,402,"","",""]
["","",0,"T",null,403,"","",""]
[{"$f":"IF(B407=\"\",\"\",A406+B407)","v":""},"",1,"H",null,404,"",{"$f":"A407","v":""},{"$f":"IF(B407=\"\",\"\",H407/F407)","v":""}]
["","",0,"T",null,405,"","",""]
["","",0,"T",null,406,"","",""]
["","",1,"H",null,407,"","",""]
["","",0,"T",null,408,"","",""]
["","",0,"T",null,409,"","",""]
["","",0,"T",null,410,"","",""]
["","",1,"H",null,411,"","",""]
["","",1,"H",null,412,"","",""]
["","",1,"H",null,413,"","",""]
["","",1,"H",null,414,"","",""]
["","",1,"H",null,415,"","",""]
["","",1,"H",null,416,"","",""]
["","",1,"H",null,417,"","",""]
["","",0,"T",null,418,"","",""]
["","",0,"T",null,419,"","",""]
["","",0,"T",null,420,"","",""]
["","",1,"H",null,421,"","",""]
["","",0,"T",null,422,"","",""]
["","",0,"T",null,423,"","",""]
["","",1,"H",null,424,"","",""]
["","",1,"H",null,425,"","",""]
["","",1,"H",null,426,"","",""]
["","",0,"T",null,427,"","",""]
["","",0,"T",null,428,"","",""]
["","",0,"T",null,429,"","",""]
["","",0,"T",null,430,"","",""]
["","",1,"H",null,431,"","",""]
["","",1,"H",null,432,"","",""]
["","",0,"T",null,433,"","",""]
["","",0,"T",null,434,"","",""]
["","",0,"T",null,435,"","",""]
["","",1,"H",null,436,"","",""]
["","",0,"T",null,437,"","",""]
["","",0,"T",null,438,"","",""]
["","",0,"T",null,439,"","",""]
["","",0,"T",null,440,"","",""]
["","",0,"T",null,441,"","",""]
["","",0,"T",null,442,"","",""]
["","",0,"T",null,443,"","",""]
["","",0,"T",null,444,"","",""]
["","",0,"T",null,445,"","",""]
["","",1,"H",null,446,"","",""]
["","",0,"T",null,447,"","",""]
["","",0,"T",null,448,"","",""]
["",{"$f":"IF(F452<I$2,C452,\"\")","v":""},1,"H",null,449,"","",""]
["","",0,"T",null,450,{"$f":"IF(H453=\"\",\"\",D453)","v":""},"",""]
["","",0,"T",null,451,"","",""]
["","",1,"H",null,452,"","",""]
["","",1,"H",null,453,"","",""]
["","",1,"H",null,454,"","",""]
["","",1,"H",null,455,"","",""]
["","",0,"T",null,456,"","",""]
["","",1,"H",null,457,"","",""]
["","",0,"T",null,458,"","",""]
["","",1,"H",null,459,"","",""]
["","",1,"H",null,460,"","",""]
["","",1,"H",null,461,"","",""]
["","",0,"T",null,462,"","",""]
["","",0,"T",null,463,"","",""]
["","",1,"H",null,464,"","",""]
["","",1,"H",null,465,"","",""]
["","",1,"H",null,466,"","",""]
["","",0,"T",null,467,"","",""]
[{"$f":"IF(B471=\"\",\"\",A470+B471)","v":""},"",1,"H",null,468,"",{"$f":"A471","v":""},{"$f":"IF(B471=\"\",\"\",H471/F471)","v":""}]
["","",1,"H",null,469,"","",""]
["","",1,"H",null,470,"","",""]
["","",0,"T",null,471,"","",""]
["","",0,"T",null,472,"","",""]
["","",0,"T",null,473,"","",""]
["","",1,"H",null,474,"","",""]
["","",0,"T",null,475,"","",""]
["","",0,"T",null,476,"","",""]
["","",1,"H",null,477,"","",""]
["","",1,"H",null,478,"","",""]
["","",0,"T",null,479,"","",""]
["","",1,"H",null,480,"","",""]
["","",1,"H",null,481,"","",""]
["","",0,"T",null,482,"","",""]
["","",0,"T",null,483,"","",""]
["","",1,"H",null,484,"","",""]
["","",0,"T",null,485,"","",""]
["","",0,"T",null,486,"","",""]
["","",0,"T",null,487,"","",""]
["","",0,"T",null,488,"","",""]
["","",1,"H",null,489,"","",""]
["","",1,"H",null,490,"","",""]
["","",1,"H",null,491,"","",""]
["","",0,"T",null,492,"","",""]
["","",0,"T",null,493,"","",""]
["","",1,"H",null,494,"","",""]
["","",0,"T",null,495,"","",""]
["","",1,"H",null,496,"","",""]
["","",0,"T",null,497,"","",""]
["","",0,"T",null,498,"","",""]
["","",0,"T",null,499,"","",""]
["","",1,"H",null,500,"","",""]

{"sheet":"Repeating Coin Flips","index":1,"n_rows":503,"n_cols":39,"rows_kept":503,"cut":false,"hidden":false,"merged":[]}
[null,null,null,null,null,null,"delete here",null,null,0,{"$f":"J1+1","v":1},{"$f":"K1+1","v":2},3,4,5,6,7,8,9,10,11,12,13,14,15,16,17,18,19,20,21,22,23,24,25,26,27,28,29]
[null,null,"Flipping a coin"]
[null,null,null,"Flip","Result","H's so far","P(Head)"]
[{"$f":"B4","v":0},{"$f":"IF(E4=\"H\",1,0)","v":0},{"$f":"INT(RAND()*2)+1","v":2},1,{"$f":"IF(C4=1,\"H\",\"T\")","v":"T"},{"$f":"A4","v":0},{"$f":"F4/D4","v":0}]
[{"$f":"A4+B5","v":1},{"$f":"IF(E5=\"H\",1,0)","v":1},{"$f":"INT(RAND()*2)+1","v":1},2,{"$f":"IF(C5=1,\"H\",\"T\")","v":"H"},{"$f":"A5","v":1},{"$f":"F5/D5","v":0.5}]
[{"$f":"A5+B6","v":2},1,1,3,"H",2,0.66666666666666663]
[2,0,2,4,"T",2,0.5]
[2,0,2,5,"T",2,0.4]
[2,0,2,6,"T",2,0.33333333333333331]
[3,1,1,7,"H",3,0.42857142857142855]
[3,0,2,8,"T",3,0.375]
[4,1,1,9,"H",4,0.44444444444444442]
[{"$f":"A12+B13","v":5},{"$f":"IF(E13=\"H\",1,0)","v":1},1,10,{"$f":"IF(C13=1,\"H\",\"T\")","v":"H"},{"$f":"A13","v":5},0.5]
[{"$f":"A13+B14","v":5},{"$f":"IF(E14=\"H\",1,0)","v":0},2,11,{"$f":"IF(C14=1,\"H\",\"T\")","v":"T"},{"$f":"A14","v":5},0.45454545454545453]
[{"$f":"A14+B15","v":5},{"$f":"IF(E15=\"H\",1,0)","v":0},2,12,{"$f":"IF(C15=1,\"H\",\"T\")","v":"T"},{"$f":"A15","v":5},{"$f":"F15/D15","v":0.41666666666666669}]
[6,1,1,13,"H",6,0.46153846153846156]
[6,0,2,14,"T",6,0.42857142857142855]
[7,1,1,15,"H",7,0.46666666666666667]
[8,1,1,16,"H",8,0.5]
[8,0,2,17,"T",8,0.47058823529411764]
[9,1,1,18,"H",9,0.5]
[10,1,1,19,"H",10,0.52631578947368418]
[11,1,1,20,"H",11,0.55000000000000004]
[11,0,2,21,"T",11,0.52380952380952384]
[12,1,1,22,"H",12,0.54545454545454541]
[12,0,2,23,"T",12,0.52173913043478259]
[13,1,1,24,"H",13,0.54166666666666663]
[14,1,1,25,"H",14,0.56000000000000005]
[14,0,2,26,"T",14,0.53846153846153844]
[14,0,2,27,"T",14,0.51851851851851849]
[14,0,2,28,"T",14,0.5]
[15,1,1,29,"H",15,0.51724137931034486]
[15,0,2,30,"T",15,0.5]
[15,0,2,31,"T",15,0.4838709677419355]
[15,0,2,32,"T",15,0.46875]
[16,1,1,33,"H",16,0.48484848484848486]
[17,1,1,34,"H",17,0.5]
[18,1,1,35,"H",18,0.51428571428571423]
[18,0,2,36,"T",18,0.5]
[18,0,2,37,"T",18,0.48648648648648651]
[19,1,1,38,"H",19,0.5]
[20,1,1,39,"H",20,0.51282051282051277]
[21,1,1,40,"H",21,0.52500000000000002]
[22,1,1,41,"H",22,0.53658536585365857]
[23,1,1,42,"H",23,0.54761904761904767]
[24,1,1,43,"H",24,0.55813953488372092]
[25,1,1,44,"H",25,0.56818181818181823]
[26,1,1,45,"H",26,0.57777777777777772]
[27,1,1,46,"H",27,0.58695652173913049]
[27,0,2,47,"T",27,0.57446808510638303]
[28,1,1,48,"H",28,0.58333333333333337]
[29,1,1,49,"H",29,0.59183673469387754]
[29,0,2,50,"T",29,0.57999999999999996]
[29,0,2,51,"T",29,0.56862745098039214]
[29,0,2,52,"T",29,0.55769230769230771]
[30,1,1,53,"H",30,0.56603773584905659]
[30,0,2,54,"T",30,0.55555555555555558]
[31,1,1,55,"H",31,0.5636363636363636]
[32,1,1,56,"H",32,0.5714285714285714]
[32,0,2,57,"T",32,0.56140350877192979]
[33,1,1,58,"H",33,0.56896551724137934]
[33,0,2,59,"T",33,0.55932203389830504]
[34,1,1,60,"H",34,0.56666666666666665]
[34,0,2,61,"T",34,0.55737704918032782]
[34,0,2,62,"T",34,0.54838709677419351]
[34,0,2,63,"T",34,0.53968253968253965]
[35,1,1,64,"H",35,0.546875]
[35,0,2,65,"T",35,0.53846153846153844]
[35,0,{"$f":"INT(RAND()*2)+1","v":2},66,"T",35,0.53030303030303028]
[35,0,2,67,"T",35,0.52238805970149249]
[36,1,1,68,"H",36,0.52941176470588236]
[36,0,2,69,"T",36,0.52173913043478259]
[36,0,2,70,"T",36,0.51428571428571423]
[36,0,2,71,"T",36,0.50704225352112675]
[36,0,2,72,"T",36,0.5]
[37,1,1,73,"H",37,0.50684931506849318]
[37,0,2,74,"T",37,0.5]
[37,0,2,75,"T",37,0.49333333333333335]
[{"$f":"A78+B79","v":37},{"$f":"IF(E79=\"H\",1,0)","v":0},2,76,{"$f":"IF(C79=1,\"H\",\"T\")","v":"T"},{"$f":"A79","v":37},{"$f":"F79/D79","v":0.48684210526315791}]
[38,1,1,77,"H",38,0.4935064935064935]
[38,0,2,78,"T",38,0.48717948717948717]
[39,1,1,79,"H",39,0.49367088607594939]
[40,1,1,80,"H",40,0.5]
[41,1,1,81,"H",41,0.50617283950617287]
[42,1,1,82,"H",42,0.51219512195121952]
[42,0,2,83,"T",42,0.50602409638554213]
[42,0,2,84,"T",42,0.5]
[43,1,1,85,"H",43,0.50588235294117645]
[43,0,2,86,"T",43,0.5]
[43,0,2,87,"T",43,0.4942528735632184]
[44,1,1,88,"H",44,0.5]
[44,0,2,89,"T",44,0.4943820224719101]
[44,0,2,90,"T",44,0.48888888888888887]
[44,0,2,91,"T",44,0.48351648351648352]
[45,1,1,92,"H",45,0.4891304347826087]
[46,1,1,93,"H",46,0.4946236559139785]
[46,0,2,94,"T",46,0.48936170212765956]
[47,1,1,95,"H",47,0.49473684210526314]
[48,1,1,96,"H",48,0.5]
[49,1,1,97,"H",49,0.50515463917525771]
[50,1,1,98,"H",50,0.51020408163265307]
[50,0,2,99,"T",50,0.50505050505050508]
[51,1,1,100,"H",51,0.51]
[52,1,1,101,"H",52,0.51485148514851486]
[52,0,2,102,"T",52,0.50980392156862742]
[53,1,1,103,"H",53,0.5145631067961165]
[53,0,2,104,"T",53,0.50961538461538458]
[54,1,1,105,"H",54,0.51428571428571423]
[54,0,2,106,"T",54,0.50943396226415094]
[54,0,2,107,"T",54,0.50467289719626163]
[55,1,1,108,"H",55,0.5092592592592593]
[56,1,1,109,"H",56,0.51376146788990829]
[57,1,1,110,"H",57,0.51818181818181819]
[58,1,1,111,"H",58,0.52252252252252251]
[58,0,2,112,"T",58,0.5178571428571429]
[58,0,2,113,"T",58,0.51327433628318586]
[58,0,2,114,"T",58,0.50877192982456143]
[58,0,2,115,"T",58,0.5043478260869565]
[59,1,1,116,"H",59,0.50862068965517238]
[60,1,1,117,"H",60,0.51282051282051277]
[60,0,2,118,"T",60,0.50847457627118642]
[60,0,2,119,"T",60,0.50420168067226889]
[60,0,2,120,"T",60,0.5]
[60,0,2,121,"T",60,0.49586776859504134]
[61,1,1,122,"H",61,0.5]
[62,1,1,123,"H",62,0.50406504065040647]
[63,1,1,124,"H",63,0.50806451612903225]
[63,0,2,125,"T",63,0.504]
[64,1,1,126,"H",64,0.50793650793650791]
[65,1,1,127,"H",65,0.51181102362204722]
[65,0,2,128,"T",65,0.5078125]
[66,1,1,129,"H",66,0.51162790697674421]
[66,0,{"$f":"INT(RAND()*2)+1","v":2},130,"T",66,0.50769230769230766]
[66,0,2,131,"T",66,0.50381679389312972]
[66,0,2,132,"T",66,0.5]
[67,1,1,133,"H",67,0.50375939849624063]
[68,1,1,134,"H",68,0.5074626865671642]
[68,0,2,135,"T",68,0.50370370370370365]
[68,0,2,136,"T",68,0.5]
[69,1,1,137,"H",69,0.5036496350364964]
[70,1,1,138,"H",70,0.50724637681159424]
[71,1,1,139,"H",71,0.51079136690647486]
[{"$f":"A142+B143","v":71},{"$f":"IF(E143=\"H\",1,0)","v":0},2,140,{"$f":"IF(C143=1,\"H\",\"T\")","v":"T"},{"$f":"A143","v":71},{"$f":"F143/D143","v":0.50714285714285712}]
[71,0,2,141,"T",71,0.50354609929078009]
[71,0,2,142,"T",71,0.5]
[72,1,1,143,"H",72,0.50349650349650354]
[73,1,1,144,"H",73,0.50694444444444442]
[73,0,2,145,"T",73,0.50344827586206897]
[73,0,2,146,"T",73,0.5]
[74,1,1,147,"H",74,0.50340136054421769]
[74,0,2,148,"T",74,0.5]
[75,1,1,149,"H",75,0.50335570469798663]
[75,0,2,150,"T",75,0.5]
[76,1,1,151,"H",76,0.50331125827814571]
[76,0,2,152,"T",76,0.5]
[76,0,2,153,"T",76,0.49673202614379086]
[77,1,1,154,"H",77,0.5]
[78,1,1,155,"H",78,0.50322580645161286]
[79,1,1,156,"H",79,0.50641025641025639]
[79,0,2,157,"T",79,0.50318471337579618]
[79,0,2,158,"T",79,0.5]
[79,0,2,159,"T",79,0.49685534591194969]
[80,1,1,160,"H",80,0.5]
[80,0,2,161,"T",80,0.49689440993788819]
[80,0,2,162,"T",80,0.49382716049382713]
[81,1,1,163,"H",81,0.49693251533742333]
[82,1,1,164,"H",82,0.5]
[82,0,2,165,"T",82,0.49696969696969695]
[82,0,2,166,"T",82,0.49397590361445781]
[83,1,1,167,"H",83,0.49700598802395207]
[84,1,1,168,"H",84,0.5]
[85,1,1,169,"H",85,0.50295857988165682]
[86,1,1,170,"H",86,0.50588235294117645]
[87,1,1,171,"H",87,0.50877192982456143]
[88,1,1,172,"H",88,0.51162790697674421]
[89,1,1,173,"H",89,0.51445086705202314]
[90,1,1,174,"H",90,0.51724137931034486]
[91,1,1,175,"H",91,0.52]
[91,0,2,176,"T",91,0.51704545454545459]
[91,0,2,177,"T",91,0.51412429378531077]
[91,0,2,178,"T",91,0.5112359550561798]
[91,0,2,179,"T",91,0.50837988826815639]
[92,1,1,180,"H",92,0.51111111111111107]
[93,1,1,181,"H",93,0.51381215469613262]
[93,0,2,182,"T",93,0.51098901098901095]
[94,1,1,183,"H",94,0.51366120218579236]
[95,1,1,184,"H",95,0.51630434782608692]
[96,1,1,185,"H",96,0.51891891891891895]
[96,0,2,186,"T",96,0.5161290322580645]
[96,0,2,187,"T",96,0.5133689839572193]
[96,0,2,188,"T",96,0.51063829787234039]
[97,1,1,189,"H",97,0.51322751322751325]
[97,0,2,190,"T",97,0.51052631578947372]
[98,1,1,191,"H",98,0.51308900523560208]
[99,1,1,192,"H",99,0.515625]
[99,0,2,193,"T",99,0.51295336787564771]
[100,1,{"$f":"INT(RAND()*2)+1","v":1},194,"H",100,0.51546391752577314]
[100,0,2,195,"T",100,0.51282051282051277]
[101,1,1,196,"H",101,0.51530612244897955]
[101,0,2,197,"T",101,0.51269035532994922]
[101,0,2,198,"T",101,0.51010101010101006]
[102,1,1,199,"H",102,0.51256281407035176]
[103,1,1,200,"H",103,0.51500000000000001]
[103,0,2,201,"T",103,0.51243781094527363]
[104,1,1,202,"H",104,0.51485148514851486]
[104,0,2,203,"T",104,0.51231527093596063]
[{"$f":"A206+B207","v":105},{"$f":"IF(E207=\"H\",1,0)","v":1},1,204,{"$f":"IF(C207=1,\"H\",\"T\")","v":"H"},{"$f":"A207","v":105},{"$f":"F207/D207","v":0.51470588235294112}]
[106,1,1,205,"H",106,0.51707317073170733]
[106,0,2,206,"T",106,0.5145631067961165]
[106,0,2,207,"T",106,0.51207729468599039]
[106,0,2,208,"T",106,0.50961538461538458]
[107,1,1,209,"H",107,0.51196172248803828]
[108,1,1,210,"H",108,0.51428571428571423]
[108,0,2,211,"T",108,0.51184834123222744]
[109,1,1,212,"H",109,0.51415094339622647]
[110,1,1,213,"H",110,0.51643192488262912]
[110,0,2,214,"T",110,0.51401869158878499]
[110,0,2,215,"T",110,0.51162790697674421]
[110,0,2,216,"T",110,0.5092592592592593]
[110,0,2,217,"T",110,0.50691244239631339]
[111,1,1,218,"H",111,0.50917431192660545]
[111,0,2,219,"T",111,0.50684931506849318]
[111,0,2,220,"T",111,0.50454545454545452]
[112,1,1,221,"H",112,0.50678733031674206]
[113,1,1,222,"H",113,0.50900900900900903]
[114,1,1,223,"H",114,0.5112107623318386]
[115,1,1,224,"H",115,0.5133928571428571]
[115,0,2,225,"T",115,0.51111111111111107]
[116,1,1,226,"H",116,0.51327433628318586]
[116,0,2,227,"T",116,0.51101321585903081]
[117,1,1,228,"H",117,0.51315789473684215]
[118,1,1,229,"H",118,0.51528384279475981]
[118,0,2,230,"T",118,0.5130434782608696]
[119,1,1,231,"H",119,0.51515151515151514]
[120,1,1,232,"H",120,0.51724137931034486]
[121,1,1,233,"H",121,0.51931330472102999]
[121,0,2,234,"T",121,0.51709401709401714]
[122,1,1,235,"H",122,0.51914893617021274]
[122,0,2,236,"T",122,0.51694915254237284]
[122,0,2,237,"T",122,0.51476793248945152]
[123,1,1,238,"H",123,0.51680672268907568]
[123,0,2,239,"T",123,0.5146443514644351]
[124,1,1,240,"H",124,0.51666666666666672]
[124,0,2,241,"T",124,0.51452282157676343]
[124,0,2,242,"T",124,0.51239669421487599]
[125,1,1,243,"H",125,0.51440329218106995]
[125,0,2,244,"T",125,0.51229508196721307]
[126,1,1,245,"H",126,0.51428571428571423]
[127,1,1,246,"H",127,0.51626016260162599]
[128,1,1,247,"H",128,0.51821862348178138]
[128,0,2,248,"T",128,0.5161290322580645]
[129,1,1,249,"H",129,0.51807228915662651]
[130,1,1,250,"H",130,0.52]
[130,0,2,251,"T",130,0.51792828685258963]
[131,1,1,252,"H",131,0.51984126984126988]
[131,0,2,253,"T",131,0.51778656126482214]
[131,0,2,254,"T",131,0.51574803149606296]
[131,0,2,255,"T",131,0.51372549019607838]
[131,0,2,256,"T",131,0.51171875]
[132,1,1,257,"H",132,0.51361867704280151]
[133,1,{"$f":"INT(RAND()*2)+1","v":1},258,"H",133,0.51550387596899228]
[134,1,1,259,"H",134,0.51737451737451734]
[134,0,2,260,"T",134,0.51538461538461533]
[134,0,2,261,"T",134,0.51340996168582376]
[135,1,1,262,"H",135,0.51526717557251911]
[135,0,2,263,"T",135,0.51330798479087447]
[135,0,2,264,"T",135,0.51136363636363635]
[136,1,1,265,"H",136,0.51320754716981132]
[136,0,2,266,"T",136,0.51127819548872178]
[137,1,1,267,"H",137,0.51310861423220977]
[{"$f":"A270+B271","v":137},{"$f":"IF(E271=\"H\",1,0)","v":0},2,268,{"$f":"IF(C271=1,\"H\",\"T\")","v":"T"},{"$f":"A271","v":137},{"$f":"F271/D271","v":0.51119402985074625}]
[138,1,1,269,"H",138,0.51301115241635686]
[138,0,2,270,"T",138,0.51111111111111107]
[138,0,2,271,"T",138,0.5092250922509225]
[138,0,2,272,"T",138,0.50735294117647056]
[139,1,1,273,"H",139,0.50915750915750912]
[140,1,1,274,"H",140,0.51094890510948909]
[141,1,1,275,"H",141,0.5127272727272727]
[141,0,2,276,"T",141,0.51086956521739135]
[142,1,1,277,"H",142,0.5126353790613718]
[142,0,2,278,"T",142,0.51079136690647486]
[143,1,1,279,"H",143,0.51254480286738346]
[144,1,1,280,"H",144,0.51428571428571423]
[145,1,1,281,"H",145,0.51601423487544484]
[145,0,2,282,"T",145,0.51418439716312059]
[146,1,1,283,"H",146,0.51590106007067138]
[146,0,2,284,"T",146,0.5140845070422535]
[147,1,1,285,"H",147,0.51578947368421058]
[147,0,2,286,"T",147,0.51398601398601396]
[147,0,2,287,"T",147,0.51219512195121952]
[148,1,1,288,"H",148,0.51388888888888884]
[148,0,2,289,"T",148,0.51211072664359858]
[149,1,1,290,"H",149,0.51379310344827589]
[149,0,2,291,"T",149,0.51202749140893467]
[149,0,2,292,"T",149,0.51027397260273977]
[150,1,1,293,"H",150,0.51194539249146753]
[150,0,2,294,"T",150,0.51020408163265307]
[150,0,2,295,"T",150,0.50847457627118642]
[151,1,1,296,"H",151,0.51013513513513509]
[151,0,2,297,"T",151,0.50841750841750843]
[152,1,1,298,"H",152,0.51006711409395977]
[152,0,2,299,"T",152,0.50836120401337792]
[153,1,1,300,"H",153,0.51]
[154,1,1,301,"H",154,0.51162790697674421]
[155,1,1,302,"H",155,0.51324503311258274]
[155,0,2,303,"T",155,0.51155115511551152]
[155,0,2,304,"T",155,0.50986842105263153]
[156,1,1,305,"H",156,0.51147540983606554]
[156,0,2,306,"T",156,0.50980392156862742]
[157,1,1,307,"H",157,0.51140065146579805]
[157,0,2,308,"T",157,0.50974025974025972]
[157,0,2,309,"T",157,0.50809061488673135]
[157,0,2,310,"T",157,0.50645161290322582]
[157,0,2,311,"T",157,0.50482315112540188]
[157,0,2,312,"T",157,0.50320512820512819]
[157,0,2,313,"T",157,0.50159744408945683]
[157,0,2,314,"T",157,0.5]
[157,0,2,315,"T",157,0.49841269841269842]
[158,1,1,316,"H",158,0.5]
[159,1,1,317,"H",159,0.50157728706624605]
[159,0,2,318,"T",159,0.5]
[159,0,2,319,"T",159,0.49843260188087773]
[159,0,2,320,"T",159,0.49687500000000001]
[159,0,2,321,"T",159,0.49532710280373832]
[159,0,{"$f":"INT(RAND()*2)+1","v":2},322,"T",159,0.49378881987577639]
[160,1,1,323,"H",160,0.49535603715170279]
[161,1,1,324,"H",161,0.49691358024691357]
[161,0,2,325,"T",161,0.49538461538461537]
[161,0,2,326,"T",161,0.49386503067484661]
[161,0,2,327,"T",161,0.49235474006116209]
[162,1,1,328,"H",162,0.49390243902439024]
[163,1,1,329,"H",163,0.49544072948328266]
[164,1,1,330,"H",164,0.49696969696969695]
[165,1,1,331,"H",165,0.49848942598187312]
[{"$f":"A334+B335","v":166},{"$f":"IF(E335=\"H\",1,0)","v":1},1,332,{"$f":"IF(C335=1,\"H\",\"T\")","v":"H"},{"$f":"A335","v":166},{"$f":"F335/D335","v":0.5}]
[166,0,2,333,"T",166,0.49849849849849848]
[167,1,1,334,"H",167,0.5]
[168,1,1,335,"H",168,0.5014925373134328]
[169,1,1,336,"H",169,0.50297619047619047]
[169,0,2,337,"T",169,0.50148367952522255]
[169,0,2,338,"T",169,0.5]
[170,1,1,339,"H",170,0.50147492625368728]
[170,0,2,340,"T",170,0.5]
[171,1,1,341,"H",171,0.50146627565982405]
[171,0,2,342,"T",171,0.5]
[172,1,1,343,"H",172,0.50145772594752192]
[172,0,2,344,"T",172,0.5]
[172,0,2,345,"T",172,0.49855072463768119]
[173,1,1,346,"H",173,0.5]
[173,0,2,347,"T",173,0.49855907780979825]
[174,1,1,348,"H",174,0.5]
[174,0,2,349,"T",174,0.49856733524355301]
[174,0,2,350,"T",174,0.49714285714285716]
[174,0,2,351,"T",174,0.49572649572649574]
[175,1,1,352,"H",175,0.49715909090909088]
[175,0,2,353,"T",175,0.49575070821529743]
[176,1,1,354,"H",176,0.49717514124293788]
[177,1,1,355,"H",177,0.49859154929577465]
[178,1,1,356,"H",178,0.5]
[178,0,2,357,"T",178,0.49859943977591037]
[178,0,2,358,"T",178,0.4972067039106145]
[178,0,2,359,"T",178,0.49582172701949861]
[179,1,1,360,"H",179,0.49722222222222223]
[179,0,2,361,"T",179,0.49584487534626037]
[180,1,1,362,"H",180,0.49723756906077349]
[181,1,1,363,"H",181,0.49862258953168043]
[182,1,1,364,"H",182,0.5]
[183,1,1,365,"H",183,0.50136986301369868]
[184,1,1,366,"H",184,0.50273224043715847]
[185,1,1,367,"H",185,0.50408719346049047]
[186,1,1,368,"H",186,0.50543478260869568]
[186,0,2,369,"T",186,0.50406504065040647]
[186,0,2,370,"T",186,0.50270270270270268]
[186,0,2,371,"T",186,0.50134770889487867]
[187,1,1,372,"H",187,0.50268817204301075]
[187,0,2,373,"T",187,0.50134048257372654]
[188,1,1,374,"H",188,0.50267379679144386]
[189,1,1,375,"H",189,0.504]
[189,0,2,376,"T",189,0.50265957446808507]
[190,1,1,377,"H",190,0.50397877984084882]
[190,0,2,378,"T",190,0.50264550264550267]
[190,0,2,379,"T",190,0.50131926121372028]
[190,0,2,380,"T",190,0.5]
[190,0,2,381,"T",190,0.49868766404199477]
[190,0,2,382,"T",190,0.49738219895287961]
[190,0,2,383,"T",190,0.4960835509138381]
[190,0,2,384,"T",190,0.49479166666666669]
[190,0,2,385,"T",190,0.4935064935064935]
[191,1,{"$f":"INT(RAND()*2)+1","v":1},386,"H",191,0.49481865284974091]
[191,0,2,387,"T",191,0.49354005167958659]
[191,0,2,388,"T",191,0.49226804123711343]
[191,0,2,389,"T",191,0.49100257069408743]
[192,1,1,390,"H",192,0.49230769230769234]
[193,1,1,391,"H",193,0.49360613810741688]
[193,0,2,392,"T",193,0.49234693877551022]
[193,0,2,393,"T",193,0.4910941475826972]
[193,0,2,394,"T",193,0.48984771573604063]
[193,0,2,395,"T",193,0.48860759493670886]
[{"$f":"A398+B399","v":193},{"$f":"IF(E399=\"H\",1,0)","v":0},2,396,{"$f":"IF(C399=1,\"H\",\"T\")","v":"T"},{"$f":"A399","v":193},{"$f":"F399/D399","v":0.48737373737373735}]
[193,0,2,397,"T",193,0.48614609571788414]
[194,1,1,398,"H",194,0.48743718592964824]
[194,0,2,399,"T",194,0.48621553884711777]
[194,0,2,400,"T",194,0.48499999999999999]
[195,1,1,401,"H",195,0.486284289276808]
[196,1,1,402,"H",196,0.48756218905472637]
[197,1,1,403,"H",197,0.48883374689826303]
[197,0,2,404,"T",197,0.48762376237623761]
[197,0,2,405,"T",197,0.48641975308641977]
[197,0,2,406,"T",197,0.48522167487684731]
[197,0,2,407,"T",197,0.48402948402948404]
[198,1,1,408,"H",198,0.48529411764705882]
[198,0,2,409,"T",198,0.4841075794621027]
[199,1,1,410,"H",199,0.48536585365853657]
[200,1,1,411,"H",200,0.48661800486618007]
[200,0,2,412,"T",200,0.4854368932038835]
[200,0,2,413,"T",200,0.48426150121065376]
[201,1,1,414,"H",201,0.48550724637681159]
[201,0,2,415,"T",201,0.48433734939759038]
[201,0,2,416,"T",201,0.48317307692307693]
[201,0,2,417,"T",201,0.48201438848920863]
[202,1,1,418,"H",202,0.48325358851674644]
[203,1,1,419,"H",203,0.48448687350835323]
[203,0,2,420,"T",203,0.48333333333333334]
[203,0,2,421,"T",203,0.48218527315914489]
[204,1,1,422,"H",204,0.48341232227488151]
[204,0,2,423,"T",204,0.48226950354609927]
[204,0,2,424,"T",204,0.48113207547169812]
[205,1,1,425,"H",205,0.4823529411764706]
[205,0,2,426,"T",205,0.48122065727699531]
[206,1,1,427,"H",206,0.48243559718969553]
[206,0,2,428,"T",206,0.48130841121495327]
[206,0,2,429,"T",206,0.48018648018648019]
[207,1,1,430,"H",207,0.4813953488372093]
[208,1,1,431,"H",208,0.48259860788863107]
[208,0,2,432,"T",208,0.48148148148148145]
[209,1,1,433,"H",209,0.48267898383371827]
[209,0,2,434,"T",209,0.48156682027649772]
[209,0,2,435,"T",209,0.48045977011494251]
[210,1,1,436,"H",210,0.48165137614678899]
[210,0,2,437,"T",210,0.4805491990846682]
[210,0,2,438,"T",210,0.47945205479452052]
[210,0,2,439,"T",210,0.4783599088838269]
[211,1,1,440,"H",211,0.47954545454545455]
[212,1,1,441,"H",212,0.48072562358276644]
[212,0,2,442,"T",212,0.47963800904977377]
[213,1,1,443,"H",213,0.48081264108352145]
[214,1,1,444,"H",214,0.481981981981982]
[214,0,2,445,"T",214,0.48089887640449436]
[214,0,2,446,"T",214,0.47982062780269058]
[215,1,1,447,"H",215,0.48098434004474272]
[215,0,2,448,"T",215,0.4799107142857143]
[215,0,2,449,"T",215,0.47884187082405344]
[215,0,{"$f":"INT(RAND()*2)+1","v":2},450,"T",215,0.4777777777777778]
[215,0,2,451,"T",215,0.47671840354767187]
[216,1,1,452,"H",216,0.47787610619469029]
[216,0,2,453,"T",216,0.47682119205298013]
[217,1,1,454,"H",217,0.47797356828193832]
[218,1,1,455,"H",218,0.47912087912087914]
[219,1,1,456,"H",219,0.48026315789473684]
[220,1,1,457,"H",220,0.48140043763676149]
[220,0,2,458,"T",220,0.48034934497816595]
[221,1,1,459,"H",221,0.48148148148148145]
[{"$f":"A462+B463","v":221},{"$f":"IF(E463=\"H\",1,0)","v":0},2,460,{"$f":"IF(C463=1,\"H\",\"T\")","v":"T"},{"$f":"A463","v":221},{"$f":"F463/D463","v":0.48043478260869565}]
[221,0,2,461,"T",221,0.4793926247288503]
[222,1,1,462,"H",222,0.48051948051948051]
[223,1,1,463,"H",223,0.4816414686825054]
[224,1,1,464,"H",224,0.48275862068965519]
[224,0,2,465,"T",224,0.48172043010752691]
[225,1,1,466,"H",225,0.48283261802575106]
[226,1,1,467,"H",226,0.48394004282655245]
[227,1,1,468,"H",227,0.48504273504273504]
[227,0,2,469,"T",227,0.48400852878464817]
[227,0,2,470,"T",227,0.48297872340425529]
[228,1,1,471,"H",228,0.48407643312101911]
[228,0,2,472,"T",228,0.48305084745762711]
[228,0,2,473,"T",228,0.48202959830866809]
[228,0,2,474,"T",228,0.48101265822784811]
[229,1,1,475,"H",229,0.48210526315789476]
[229,0,2,476,"T",229,0.48109243697478993]
[230,1,1,477,"H",230,0.48218029350104824]
[231,1,1,478,"H",231,0.48326359832635984]
[232,1,1,479,"H",232,0.48434237995824636]
[233,1,1,480,"H",233,0.48541666666666666]
[234,1,1,481,"H",234,0.48648648648648651]
[235,1,1,482,"H",235,0.487551867219917]
[235,0,2,483,"T",235,0.48654244306418221]
[235,0,2,484,"T",235,0.48553719008264462]
[236,1,1,485,"H",236,0.48659793814432989]
[237,1,1,486,"H",237,0.48765432098765432]
[237,0,2,487,"T",237,0.486652977412731]
[238,1,1,488,"H",238,0.48770491803278687]
[238,0,2,489,"T",238,0.48670756646216767]
[239,1,1,490,"H",239,0.48775510204081635]
[240,1,1,491,"H",240,0.48879837067209775]
[240,0,2,492,"T",240,0.48780487804878048]
[240,0,2,493,"T",240,0.48681541582150101]
[241,1,1,494,"H",241,0.48785425101214575]
[241,0,2,495,"T",241,0.4868686868686869]
[242,1,1,496,"H",242,0.48790322580645162]
[242,0,2,497,"T",242,0.48692152917505033]
[243,1,1,498,"H",243,0.48795180722891568]
[243,0,2,499,"T",243,0.48697394789579157]
[244,1,1,500,"H",244,0.48799999999999999]

{"sheet":"Sheet2","index":2,"n_rows":0,"n_cols":0,"rows_kept":0,"cut":false,"hidden":false,"merged":[]}

{"sheet":"Sheet3","index":3,"n_rows":0,"n_cols":0,"rows_kept":0,"cut":false,"hidden":false,"merged":[]}